{"text_format":"1","workbook":"xlsx","n_sheets":10,"sheets":["目次","取組対象の選択","社員一覧の作成","職務(役割)評価","該当者抽出","(List)職務(役割)評価表","活用係数の設定","時間賃率の計算","均等・均衡待遇のチェック","(List)職務評価結果一覧"],"not_rendered":{"charts":3,"images":0,"macros":1,"external_links":0,"defined_names":11,"comments":2,"pivot_tables":0},"unopened":[],"bounds":{"document_bytes":16777216,"sheet_cells":100000,"rows_first":2000,"rows_last":500,"rows_between":2000,"halvings":0,"cell_chars":16384,"cell_head_chars":4096},"cells_cut":0,"cells_raw":0,"read":"whole","date_system":"1900"}

{"sheet":"目次","index":0,"n_rows":22,"n_cols":21,"rows_kept":22,"cut":false,"hidden":false,"merged":[[4,10,4,14],[5,10,5,14]]}
[]
["目次",null,null,null,"Step1",null,null,null,null,null,null,null,null,null,null,null,null,null,null,null,"Step3"]
[null,"職務（役割）評価をやってみましょう",null,null,null,null,null,null,null,"均等･均衡待遇が図られているか",null,null,null,null,null,null,null,"職務（役割）評価結果を活用して"]
[null,null,null,null,null,null,null,null,null,"チェックしてみましょう",null,null,null,null,null,null,null,"均等･均衡待遇を実現できる制度を"]
[]
[null,null,null,null,null,null,null,null,null,null,"※ お手元に「社員一覧」・「社員個別の基本給\n　一覧」をご準備ください",null,null,null,null,null,null,"検討してみましょう！（応用編）"]
[]
[null,null,"1.職務（役割）評価表の確認",null,null,null,null,null,null,null,null,null,null,null,null,null,null,null,"1.パートタイム労働者･有期"]
[null,null,"↓",null,null,null,null,null,null,null,null,null,null,null,null,null,null,null,"　雇用労働者の格付け（役割"]
[null,null,"2.職務（役割）評価の試行",null,null,null,null,null,null,null,null,null,null,null,null,null,null,null,"　等級）制度の設計"]
[null,null,"↓",null,null,null,null,null,null,null,null,null,null,null,null,null,null,null,"↓"]
[null,null,"3.評価結果の視覚化",null,null,null,null,null,null,null,null,null,null,null,null,null,null,null,"2.正社員の職能資格制度との"]
[null,null,null,null,null,null,null,null,null,null,null,null,null,null,null,null,null,null,"　対応関係の設定"]
[null,null,null,null,null,null,null,null,null,null,null,null,null,null,null,null,null,null,"↓"]
[null,null,null,null,null,null,null,null,null,null,null,null,null,null,null,null,null,null,"3.職務（役割）評価表の"]
[null,null,null,null,null,null,null,null,null,null,null,null,null,null,null,null,null,null,"　カスタマイズ"]
[null,null,null,null,null,null,null,null,null,null,null,null,null,null,null,null,null,null,"↓"]
[null,null,null,null,null,null,null,null,null,null,null,null,null,null,null,null,null,null,"4.職務（役割）評価の実施"]
[null,null,null,null,null,null,null,null,null,null,null,null,null,null,null,null,null,null,"↓"]
[null,null,null,null,null,null,null,null,null,null,null,null,null,null,null,null,null,null,"5.職務（役割）評価を用いた"]
{"$rows_left_out":3}
{"sheet":"取組対象の選択","index":1,"n_rows":22,"n_cols":11,"rows_kept":22,"cut":false,"hidden":false,"merged":[]}
[]
[]
[]
[]
[]
[]
[]
[]
["取組対象の選択",null,null,"■色のセル…入力必要項目"]
[]
[null,null,null,"対象とする社員タイプ",null,null,null,null,null,1,{"$f":"IF(D12=0,\"\",D12)","v":"パート１"}]
[null,null,"取組対象①","パート１",null,null,null,null,{"$f":"IF(D12=\"\",\"\",D16)","v":"総合職"},2,{"$f":"IF(D13=0,\"\",D13)","v":"サポート"}]
[null,null,"取組対象②","サポート",null,null,null,null,{"$f":"IF(D13=\"\",\"\",D16)","v":"総合職"},3,""]
[null,null,"取組対象③",null,null,null,null,null,{"$f":"IF(D14=\"\",\"\",D16)","v":""},4,{"$f":"IF(D16=0,\"\",D16)","v":"総合職"}]
[null,null,null,null,null,null,null,null,null,5,{"$f":"IF(D19=0,\"\",\"(対象外)　\"&D19)","v":"(対象外)　アシスタント"}]
[null,null,"比較対象","総合職",null,null,null,null,null,6,{"$f":"IF(D20=0,\"\",\"(対象外)　\"&D20)","v":"(対象外)　一般職"}]
[null,null,null,null,null,null,null,null,null,7,""]
[null,null,null,"対象外の社員タイプ",null,null,null,null,null,8,""]
[null,null,null,"アシスタント",null,null,null,null,null,9,""]
[null,null,null,"一般職",null,null,null,null,null,10,""]
{"$rows_left_out":3}
{"sheet":"社員一覧の作成","index":2,"n_rows":26,"n_cols":4,"rows_kept":26,"cut":false,"hidden":false,"merged":[]}
[]
[]
[]
[]
[]
[]
[]
[null,"社員一覧の作成"]
[null,null,null,"■色のセル…入力必要項目"]
[]
[]
[null,"社員No.等","社員タイプ","備考・メモ"]
[null,"B001","(対象外)一般職"]
[null,"B002","(対象外)一般職"]
[null,"B003","総合職"]
[null,"B004","総合職"]
[null,"B005","総合職"]
[null,"P001","サポート"]
[null,"P002","サポート"]
[null,"P003","サポート"]
{"$rows_left_out":7}
{"sheet":"職務(役割)評価","index":3,"n_rows":25,"n_cols":12,"rows_kept":25,"cut":false,"hidden":false,"merged":[[11,9,11,10]]}
[]
[]
[]
[]
[]
[]
[]
[null,"職務評価表の実施"]
[null,null,null,"社員タイプ"]
[null,{"$f":"NOW()","v":"2021-06-29T11:45:19.230"},{"$f":"E14","v":"B003"},4,{"$f":"VLOOKUP(D10,取組対象の選択!$J$11:$K$20,2,FALSE)","v":"総合職"}]
[null,"X",null,null,null,null,null,"","■色のセル…入力必要項目"]
[null,"X",null,"社員No.等",null,null,null,"",null,"スケール"]
[null,"X",null,3,null,"＃","評価項目","定義","ウェイト","スケール別の定義","スケール数値","ポイント"]
[null,"X",null,1,"B003",1,{"$f":"IFERROR(VLOOKUP($F14,'(List)職務(役割)評価表'!$C$10:$P$20,2,FALSE),\"\")","v":"人材代替性"},{"$f":"IFERROR(VLOOKUP($F14,'(List)職務(役割)評価表'!$C$10:$P$20,3,FALSE),\"\")","v":"採用や配置転換によって代わりの人材を探すのが難しい仕事"},1,null,2,{"$f":"IF(G14=\"\",\"\",I14*K14)","v":2}]
[null,"X",null,null,null,2,{"$f":"IFERROR(VLOOKUP($F15,'(List)職務(役割)評価表'!$C$10:$P$20,2,FALSE),\"\")","v":"革新性"},{"$f":"IFERROR(VLOOKUP($F15,'(List)職務(役割)評価表'!$C$10:$P$20,3,FALSE),\"\")","v":"現在の方法とは全く異なる新しい方法が求められる仕事"},1,null,2,{"$f":"IF(G15=\"\",\"\",I15*K15)","v":2}]
[null,"X",null,null,null,3,{"$f":"IFERROR(VLOOKUP($F16,'(List)職務(役割)評価表'!$C$10:$P$20,2,FALSE),\"\")","v":"専門性"},{"$f":"IFERROR(VLOOKUP($F16,'(List)職務(役割)評価表'!$C$10:$P$20,3,FALSE),\"\")","v":"仕事を進める上で特殊なｽｷﾙや技能が必要な仕事"},1,null,2,2]
[null,"X",null,null,null,4,{"$f":"IFERROR(VLOOKUP($F17,'(List)職務(役割)評価表'!$C$10:$P$20,2,FALSE),\"\")","v":"裁量性"},{"$f":"IFERROR(VLOOKUP($F17,'(List)職務(役割)評価表'!$C$10:$P$20,3,FALSE),\"\")","v":"従業員の裁量に任せる仕事"},1,null,2,2]
[null,"X",null,null,null,5,{"$f":"IFERROR(VLOOKUP($F18,'(List)職務(役割)評価表'!$C$10:$P$20,2,FALSE),\"\")","v":"対人関係の複雑さ（部門外／社外）"},{"$f":"IFERROR(VLOOKUP($F18,'(List)職務(役割)評価表'!$C$10:$P$20,3,FALSE),\"\")","v":"仕事を行う上で、社外の取引先や顧客、部門外との調整が多い仕事"},1,null,1,1]
[null,"X",null,null,null,6,{"$f":"IFERROR(VLOOKUP($F19,'(List)職務(役割)評価表'!$C$10:$P$20,2,FALSE),\"\")","v":"対人関係の複雑さ\n（部門内）"},{"$f":"IFERROR(VLOOKUP($F19,'(List)職務(役割)評価表'!$C$10:$P$20,3,FALSE),\"\")","v":"仕事を進める上で部門内の人材との調整が多い仕事"},1,null,1,1]
[null,"X",null,null,null,7,{"$f":"IFERROR(VLOOKUP($F20,'(List)職務(役割)評価表'!$C$10:$P$20,2,FALSE),\"\")","v":"問題解決の困難度"},{"$f":"IFERROR(VLOOKUP($F20,'(List)職務(役割)評価表'!$C$10:$P$20,3,FALSE),\"\")","v":"職務に関する課題を調査・抽出し、解決につなげる仕事"},1,null,1,1]
{"$rows_left_out":6}
{"sheet":"該当者抽出","index":4,"n_rows":51,"n_cols":2,"rows_kept":51,"cut":false,"hidden":true,"merged":[]}
["＃","社員No.等"]
[1,"B003"]
[2,"B004"]
[3,"B005"]
[4,"B006"]
[5]
[6]
[7]
[8]
[9]
[10]
[11]
[12]
[13]
[14]
[15]
[16]
[17]
[18]
[19]
{"$rows_left_out":32}
{"sheet":"(List)職務(役割)評価表","index":5,"n_rows":20,"n_cols":39,"rows_kept":20,"cut":false,"hidden":true,"merged":[]}
[]
[]
[]
[]
[null,null,"職務（役割）評価表のカスタマイズ"]
[]
[null,null,null,"項目","項目の定義","ウェイト","スケール",null,null,null,null,null,null,null,null,null,null,null,null,1,{"$f":"T7+1","v":2},{"$f":"U7+1","v":3},4,5,6,7,8,9,10,11]
[null,null,null,null,null,"✓","✓","✓","✓","✓","✓","✓","✓","✓","✓","✓"]
[null,"✓","＃",null,null,null,1,2,3,4,5,6,7,8,9,10,null,null,1,{"$f":"IF(TRANSPOSE($G$10:$P$20)=0,\"\",TRANSPOSE($G$10:$P$20))","v":"採用や配置転換による代替人材の確保が非常に容易な仕事"},"現在の手法をそのまま活用出来る仕事","それほど専門性が必要とされない仕事","原則として自由裁量のない仕事","部門外・社外との交渉・折衝業務がない仕事","部門内との調整作業がない仕事","既存の方法で解決出来ることが多い仕事","経営への影響度が非常に軽微な仕事","","",""]
[null,"✓",{"$f":"IF(D10=\"\",\"\",SUM(C9)+1)","v":1},"人材代替性","採用や配置転換によって代わりの人材を探すのが難しい仕事",1,"採用や配置転換による代替人材の確保が非常に容易な仕事","採用や配置転換による代替人材の確保が容易な仕事","採用や配置転換による代替人材の確保が難しい仕事","採用や配置転換による代替人材の確保が非常に難しい仕事","採用や配置転換による代替人材の確保が不可能な仕事",null,null,null,null,null,null,null,{"$f":"H9","v":2},"採用や配置転換による代替人材の確保が容易な仕事","現在の手法をかなりそのまま活用出来る仕事","担当分野において平均的な専門性が必要とされる仕事","自由裁量を行使した結果が、本人のみに影響を与える仕事","部門外・社外との交渉・折衝業務が少ない仕事","部門内との調整作業が少ない仕事","既存の方法を少しｱﾚﾝｼﾞすることで解決出来ることが多い仕事","経営への影響度が軽微な仕事","","","",null,"人材代替性","採用や配置転換によって代わりの人材を探すのが難しい仕事",1,"採用や配置転換による代替人材の確保が非常に容易な仕事","採用や配置転換による代替人材の確保が容易な仕事","採用や配置転換による代替人材の確保が難しい仕事","採用や配置転換による代替人材の確保が非常に難しい仕事","採用や配置転換による代替人材の確保が不可能な仕事"]
[null,"✓",{"$f":"IF(D11=\"\",\"\",SUM(C10)+1)","v":2},"革新性","現在の方法とは全く異なる新しい方法が求められる仕事",1,"現在の手法をそのまま活用出来る仕事","現在の手法をかなりそのまま活用出来る仕事","現在の手法をある程度活用出来る仕事","現在の手法を参考程度にしながら、異なるものが求められる仕事","現在の手法と全く異なるものが求められる仕事",null,null,null,null,null,null,null,{"$f":"I9","v":3},"採用や配置転換による代替人材の確保が難しい仕事","現在の手法をある程度活用出来る仕事","担当分野において高い専門性が必要とされる仕事","自由裁量を行使した結果が、当該部門の一部に影響を与える仕事","部門外・社外との交渉・折衝業務がやや多い仕事","部門内との調整作業がやや多い仕事","既存の方法を大きくｱﾚﾝｼﾞすることで解決出来ることが多い仕事","経営への影響度がやや大きな仕事","","","",null,"革新性","現在の方法とは全く異なる新しい方法が求められる仕事",1,"現在の手法をそのまま活用出来る仕事","現在の手法をかなりそのまま活用出来る仕事","現在の手法をある程度活用出来る仕事","現在の手法を参考程度にしながら、異なるものが求められる仕事","現在の手法と全く異なるものが求められる仕事"]
[null,"✓",3,"専門性","仕事を進める上で特殊なｽｷﾙや技能が必要な仕事",1,"それほど専門性が必要とされない仕事","担当分野において平均的な専門性が必要とされる仕事","担当分野において高い専門性が必要とされる仕事","担当分野において高い専門性が必要とされ、かつその周辺分野においても平均的な専門性が必要とされる仕事","担当分野において高い専門性が必要とされ、かつその周辺分野においても高い専門性が必要とされる仕事",null,null,null,null,null,null,null,{"$f":"J9","v":4},"採用や配置転換による代替人材の確保が非常に難しい仕事","現在の手法を参考程度にしながら、異なるものが求められる仕事","担当分野において高い専門性が必要とされ、かつその周辺分野においても平均的な専門性が必要とされる仕事","自由裁量を行使した結果が、当該部門全体に影響を与える仕事","部門外・社外との交渉・折衝業務が多い仕事","部門内との調整作業が多い仕事","既存の方法を参考にしつつも、新しい方法を用いなければ解決出来ないことが多い仕事","経営への影響度が大きな仕事","","","",null,"専門性","仕事を進める上で特殊なｽｷﾙや技能が必要な仕事",1,"それほど専門性が必要とされない仕事","担当分野において平均的な専門性が必要とされる仕事","担当分野において高い専門性が必要とされる仕事","担当分野において高い専門性が必要とされ、かつその周辺分野においても平均的な専門性が必要とされる仕事","担当分野において高い専門性が必要とされ、かつその周辺分野においても高い専門性が必要とされる仕事"]
[null,"✓",4,"裁量性","従業員の裁量に任せる仕事",1,"原則として自由裁量のない仕事","自由裁量を行使した結果が、本人のみに影響を与える仕事","自由裁量を行使した結果が、当該部門の一部に影響を与える仕事","自由裁量を行使した結果が、当該部門全体に影響を与える仕事","自由裁量を行使した結果が、企業全体に影響を与える仕事",null,null,null,null,null,null,null,{"$f":"K9","v":5},"採用や配置転換による代替人材の確保が不可能な仕事","現在の手法と全く異なるものが求められる仕事","担当分野において高い専門性が必要とされ、かつその周辺分野においても高い専門性が必要とされる仕事","自由裁量を行使した結果が、企業全体に影響を与える仕事","部門外・社外との交渉・折衝業務が非常に多い仕事","部門内との調整作業が非常に多い仕事","最初から新しい方法を用いなければ解決出来ない仕事","経営への影響度が非常に大きな仕事","","","",null,"裁量性","従業員の裁量に任せる仕事",1,"原則として自由裁量のない仕事","自由裁量を行使した結果が、本人のみに影響を与える仕事","自由裁量を行使した結果が、当該部門の一部に影響を与える仕事","自由裁量を行使した結果が、当該部門全体に影響を与える仕事","自由裁量を行使した結果が、企業全体に影響を与える仕事"]
[null,"✓",5,"対人関係の複雑さ（部門外／社外）","仕事を行う上で、社外の取引先や顧客、部門外との調整が多い仕事",1,"部門外・社外との交渉・折衝業務がない仕事","部門外・社外との交渉・折衝業務が少ない仕事","部門外・社外との交渉・折衝業務がやや多い仕事","部門外・社外との交渉・折衝業務が多い仕事","部門外・社外との交渉・折衝業務が非常に多い仕事",null,null,null,null,null,null,null,{"$f":"L9","v":6},"","","","","","","","","","","",null,"対人関係の複雑さ（部門外／社外）","仕事を行う上で、社外の取引先や顧客、部門外との調整が多い仕事",1,"部門外・社外との交渉・折衝業務がない仕事","部門外・社外との交渉・折衝業務が少ない仕事","部門外・社外との交渉・折衝業務がやや多い仕事","部門外・社外との交渉・折衝業務が多い仕事","部門外・社外との交渉・折衝業務が非常に多い仕事"]
[null,"✓",6,"対人関係の複雑さ\n（部門内）","仕事を進める上で部門内の人材との調整が多い仕事",1,"部門内との調整作業がない仕事","部門内との調整作業が少ない仕事","部門内との調整作業がやや多い仕事","部門内との調整作業が多い仕事","部門内との調整作業が非常に多い仕事",null,null,null,null,null,null,null,{"$f":"M9","v":7},"","","","","","","","","","","",null,"対人関係の複雑さ\n（部門内）","仕事を進める上で部門内の人材との調整が多い仕事",1,"部門内との調整作業がない仕事","部門内との調整作業が少ない仕事","部門内との調整作業がやや多い仕事","部門内との調整作業が多い仕事","部門内との調整作業が非常に多い仕事"]
[null,"✓",7,"問題解決の困難度","職務に関する課題を調査・抽出し、解決につなげる仕事",1,"既存の方法で解決出来ることが多い仕事","既存の方法を少しｱﾚﾝｼﾞすることで解決出来ることが多い仕事","既存の方法を大きくｱﾚﾝｼﾞすることで解決出来ることが多い仕事","既存の方法を参考にしつつも、新しい方法を用いなければ解決出来ないことが多い仕事","最初から新しい方法を用いなければ解決出来ない仕事",null,null,null,null,null,null,null,{"$f":"N9","v":8},"","","","","","","","","","","",null,"問題解決の困難度","職務に関する課題を調査・抽出し、解決につなげる仕事",1,"既存の方法で解決出来ることが多い仕事","既存の方法を少しｱﾚﾝｼﾞすることで解決出来ることが多い仕事","既存の方法を大きくｱﾚﾝｼﾞすることで解決出来ることが多い仕事","既存の方法を参考にしつつも、新しい方法を用いなければ解決出来ないことが多い仕事","最初から新しい方法を用いなければ解決出来ない仕事"]
[null,"✓",8,"経営への影響度","会社全体への業績に大きく影響する仕事",1,"経営への影響度が非常に軽微な仕事","経営への影響度が軽微な仕事","経営への影響度がやや大きな仕事","経営への影響度が大きな仕事","経営への影響度が非常に大きな仕事",null,null,null,null,null,null,null,{"$f":"O9","v":9},"","","","","","","","","","","",null,"経営への影響度","会社全体への業績に大きく影響する仕事",1,"経営への影響度が非常に軽微な仕事","経営への影響度が軽微な仕事","経営への影響度がやや大きな仕事","経営への影響度が大きな仕事","経営への影響度が非常に大きな仕事"]
[null,null,"",null,null,null,null,null,null,null,null,null,null,null,null,null,null,null,{"$f":"P9","v":10},"","","","","","","","","","",""]
[null,null,""]
[null,null,""]
{"$rows_left_out":1}
{"sheet":"活用係数の設定","index":6,"n_rows":58,"n_cols":13,"rows_kept":58,"cut":false,"hidden":false,"merged":[[51,9,51,11],[52,9,52,11],[53,9,53,11],[55,7,55,8],[35,9,35,11],[36,9,36,11],[38,7,38,8],[45,4,45,5],[46,4,46,5],[12,4,12,5],[11,4,11,5],[28,4,28,5],[29,4,29,5],[34,9,34,11],[17,9,17,11],[18,9,18,11],[19,9,19,11],[21,7,21,8]]}
[]
[]
[]
[]
[]
[]
[]
[]
[]
["活用係数の設定",null,null,null,null,null,"■色のセル…入力必要項目"]
[]
[null,null,null,"取組対象①：",{"$f":"IF(取組対象の選択!D12=0,\"\",取組対象の選択!D12)","v":"パート１"},null,{"$f":"IF(E12=\"\",\"\",H24)","v":0.9}]
[null,null,null,"比較対象：",{"$f":"IF(取組対象の選択!I12=0,\"\",取組対象の選択!I12)","v":"総合職"}]
[]
[null,{"$f":"\"人材活用の仕組みや運用\"","v":"人材活用の仕組みや運用"}]
[]
[null,null,null,null,null,null,null,"ある/ない",null,null,"備考"]
[null,"・転居を伴う配置転換等、働く場所の変更可能性に差が------------>",null,null,null,null,null,"ある",null,"正社員は全国転勤ありだが、エキスパートは地域限定",null,null,"設定しない"]
[null,"・職務や職種の変更など、従事する仕事の変更可能性に差が------->",null,null,null,null,null,"ない",null,"どちらも職種変更はない",null,null,"設定する"]
[null,"・時間外、休日労働、深夜勤務等、労働時間の変更可能性に差が-->",null,null,null,null,null,"ない",null,"どちらも時間外等の違いはない",null,null,1]
{"$rows_left_out":39}
{"sheet":"時間賃率の計算","index":7,"n_rows":65,"n_cols":9,"rows_kept":65,"cut":false,"hidden":false,"merged":[]}
[]
[]
[]
[]
[]
[]
[]
[null,null,null,null,"時間賃率の計算"]
[null,null,null,null,"■色のセル…入力必要項目"]
[]
[]
[null,"社員No.等","社員タイプ","職務（役割）\nポイント","時間賃率\n（活用係数反映前）","時間賃率（活用係数反映後）取組対象①との比較","時間賃率（活用係数反映後）取組対象②の比較","時間賃率（活用係数反映後）取組対象③との比較","備考・メモ"]
[null,{"$f":"IF(社員一覧の作成!B13=\"\",\"\",社員一覧の作成!B13)","v":"B001"},{"$f":"IF(社員一覧の作成!C13=\"\",\"\",社員一覧の作成!C13)","v":"(対象外)一般職"},8,1000,{"$f":"IF(取組対象の選択!$D$12=\"\",\"\",IF(C13=\"\",\"\",IF(C13=活用係数の設定!$E$13,活用係数の設定!$H$24*E13,\"\")))","v":""},{"$f":"IF(取組対象の選択!$D$13=\"\",\"\",IF(C13=\"\",\"\",IF(C13=活用係数の設定!$E$30,活用係数の設定!$H$41*E13,\"\")))","v":""},{"$f":"IF(取組対象の選択!$D$14=\"\",\"\",IF(C13=\"\",\"\",IF(C13=活用係数の設定!$E$47,活用係数の設定!$H$58*E13,\"\")))","v":""},{"$f":"IF(社員一覧の作成!D13=\"\",\"\",社員一覧の作成!D13)","v":""}]
[null,{"$f":"IF(社員一覧の作成!B14=\"\",\"\",社員一覧の作成!B14)","v":"B002"},{"$f":"IF(社員一覧の作成!C14=\"\",\"\",社員一覧の作成!C14)","v":"(対象外)一般職"},11,1200,{"$f":"IF(取組対象の選択!$D$12=\"\",\"\",IF(C14=\"\",\"\",IF(C14=活用係数の設定!$E$13,活用係数の設定!$H$24*E14,\"\")))","v":""},{"$f":"IF(取組対象の選択!$D$13=\"\",\"\",IF(C14=\"\",\"\",IF(C14=活用係数の設定!$E$30,活用係数の設定!$H$41*E14,\"\")))","v":""},{"$f":"IF(取組対象の選択!$D$14=\"\",\"\",IF(C14=\"\",\"\",IF(C14=活用係数の設定!$E$47,活用係数の設定!$H$58*E14,\"\")))","v":""},{"$f":"IF(社員一覧の作成!D14=\"\",\"\",社員一覧の作成!D14)","v":""}]
[null,{"$f":"IF(社員一覧の作成!B15=\"\",\"\",社員一覧の作成!B15)","v":"B003"},{"$f":"IF(社員一覧の作成!C15=\"\",\"\",社員一覧の作成!C15)","v":"総合職"},14,1300,{"$f":"IF(取組対象の選択!$D$12=\"\",\"\",IF(C15=\"\",\"\",IF(C15=活用係数の設定!$E$13,活用係数の設定!$H$24*E15,\"\")))","v":1170},{"$f":"IF(取組対象の選択!$D$13=\"\",\"\",IF(C15=\"\",\"\",IF(C15=活用係数の設定!$E$30,活用係数の設定!$H$41*E15,\"\")))","v":1040},{"$f":"IF(取組対象の選択!$D$14=\"\",\"\",IF(C15=\"\",\"\",IF(C15=活用係数の設定!$E$47,活用係数の設定!$H$58*E15,\"\")))","v":""},{"$f":"IF(社員一覧の作成!D15=\"\",\"\",社員一覧の作成!D15)","v":""}]
[null,{"$f":"IF(社員一覧の作成!B16=\"\",\"\",社員一覧の作成!B16)","v":"B004"},{"$f":"IF(社員一覧の作成!C16=\"\",\"\",社員一覧の作成!C16)","v":"総合職"},13,1500,{"$f":"IF(取組対象の選択!$D$12=\"\",\"\",IF(C16=\"\",\"\",IF(C16=活用係数の設定!$E$13,活用係数の設定!$H$24*E16,\"\")))","v":1350},{"$f":"IF(取組対象の選択!$D$13=\"\",\"\",IF(C16=\"\",\"\",IF(C16=活用係数の設定!$E$30,活用係数の設定!$H$41*E16,\"\")))","v":1200},{"$f":"IF(取組対象の選択!$D$14=\"\",\"\",IF(C16=\"\",\"\",IF(C16=活用係数の設定!$E$47,活用係数の設定!$H$58*E16,\"\")))","v":""},{"$f":"IF(社員一覧の作成!D16=\"\",\"\",社員一覧の作成!D16)","v":""}]
[null,{"$f":"IF(社員一覧の作成!B17=\"\",\"\",社員一覧の作成!B17)","v":"B005"},{"$f":"IF(社員一覧の作成!C17=\"\",\"\",社員一覧の作成!C17)","v":"総合職"},14,1550,{"$f":"IF(取組対象の選択!$D$12=\"\",\"\",IF(C17=\"\",\"\",IF(C17=活用係数の設定!$E$13,活用係数の設定!$H$24*E17,\"\")))","v":1395},{"$f":"IF(取組対象の選択!$D$13=\"\",\"\",IF(C17=\"\",\"\",IF(C17=活用係数の設定!$E$30,活用係数の設定!$H$41*E17,\"\")))","v":1240},{"$f":"IF(取組対象の選択!$D$14=\"\",\"\",IF(C17=\"\",\"\",IF(C17=活用係数の設定!$E$47,活用係数の設定!$H$58*E17,\"\")))","v":""},{"$f":"IF(社員一覧の作成!D17=\"\",\"\",社員一覧の作成!D17)","v":""}]
[null,{"$f":"IF(社員一覧の作成!B18=\"\",\"\",社員一覧の作成!B18)","v":"P001"},{"$f":"IF(社員一覧の作成!C18=\"\",\"\",社員一覧の作成!C18)","v":"サポート"},8,900,{"$f":"IF(取組対象の選択!$D$12=\"\",\"\",IF(C18=\"\",\"\",IF(C18=活用係数の設定!$E$13,活用係数の設定!$H$24*E18,\"\")))","v":""},{"$f":"IF(取組対象の選択!$D$13=\"\",\"\",IF(C18=\"\",\"\",IF(C18=活用係数の設定!$E$30,活用係数の設定!$H$41*E18,\"\")))","v":""},{"$f":"IF(取組対象の選択!$D$14=\"\",\"\",IF(C18=\"\",\"\",IF(C18=活用係数の設定!$E$47,活用係数の設定!$H$58*E18,\"\")))","v":""},{"$f":"IF(社員一覧の作成!D18=\"\",\"\",社員一覧の作成!D18)","v":""}]
[null,{"$f":"IF(社員一覧の作成!B19=\"\",\"\",社員一覧の作成!B19)","v":"P002"},{"$f":"IF(社員一覧の作成!C19=\"\",\"\",社員一覧の作成!C19)","v":"サポート"},11,1000,{"$f":"IF(取組対象の選択!$D$12=\"\",\"\",IF(C19=\"\",\"\",IF(C19=活用係数の設定!$E$13,活用係数の設定!$H$24*E19,\"\")))","v":""},{"$f":"IF(取組対象の選択!$D$13=\"\",\"\",IF(C19=\"\",\"\",IF(C19=活用係数の設定!$E$30,活用係数の設定!$H$41*E19,\"\")))","v":""},{"$f":"IF(取組対象の選択!$D$14=\"\",\"\",IF(C19=\"\",\"\",IF(C19=活用係数の設定!$E$47,活用係数の設定!$H$58*E19,\"\")))","v":""},{"$f":"IF(社員一覧の作成!D19=\"\",\"\",社員一覧の作成!D19)","v":""}]
[null,{"$f":"IF(社員一覧の作成!B20=\"\",\"\",社員一覧の作成!B20)","v":"P003"},{"$f":"IF(社員一覧の作成!C20=\"\",\"\",社員一覧の作成!C20)","v":"サポート"},10,900,{"$f":"IF(取組対象の選択!$D$12=\"\",\"\",IF(C20=\"\",\"\",IF(C20=活用係数の設定!$E$13,活用係数の設定!$H$24*E20,\"\")))","v":""},{"$f":"IF(取組対象の選択!$D$13=\"\",\"\",IF(C20=\"\",\"\",IF(C20=活用係数の設定!$E$30,活用係数の設定!$H$41*E20,\"\")))","v":""},{"$f":"IF(取組対象の選択!$D$14=\"\",\"\",IF(C20=\"\",\"\",IF(C20=活用係数の設定!$E$47,活用係数の設定!$H$58*E20,\"\")))","v":""},{"$f":"IF(社員一覧の作成!D20=\"\",\"\",社員一覧の作成!D20)","v":""}]
{"$rows_left_out":46}
{"sheet":"均等・均衡待遇のチェック","index":8,"n_rows":99,"n_cols":31,"rows_kept":99,"cut":false,"hidden":false,"merged":[[13,5,13,6],[11,8,11,9],[13,8,13,9],[11,2,11,3],[13,2,13,3],[11,5,11,6]]}
[]
[]
[]
[]
[]
[]
[]
[]
["均等・均衡待遇のチェック"]
[null,"プロット図①",null,null,"プロット図②",null,null,"プロット図③"]
[null,"　取組対象とするパート・有期：",null,null,"　取組対象とするパート・有期：",null,null,"　取組対象とするパート・有期："]
[null,null,{"$f":"IF(取組対象の選択!D12=0,\"\",取組対象の選択!D12)","v":"パート１"},null,null,{"$f":"IF(取組対象の選択!D13=0,\"\",取組対象の選択!D13)","v":"サポート"},null,null,{"$f":"IF(取組対象の選択!D14=0,\"\",取組対象の選択!D14)","v":""}]
[null,"　比較対象とする正社員：",null,null,"　比較対象とする正社員：",null,null,"　比較対象とする正社員："]
[null,null,{"$f":"IF(取組対象の選択!I12=0,\"\",取組対象の選択!I12)","v":"総合職"},null,null,{"$f":"IF(取組対象の選択!I13=0,\"\",取組対象の選択!I13)","v":"総合職"},null,null,{"$f":"IF(取組対象の選択!I14=0,\"\",取組対象の選択!I14)","v":""}]
[null,null,null,""]
[null,null,null,""]
[null,null,"プロット図①",null,null,{"$f":"C12&\"と\"&C14&\"の比較\"","v":"パート１と総合職の比較"},null,null,null,null,null,null,"プロット図②",null,null,{"$f":"F12&\"と\"&F14&\"の比較\"","v":"サポートと総合職の比較"},null,null,null,null,null,null,null,null,"プロット図③",null,null,{"$f":"I12&\"と\"&I14&\"の比較\"","v":"との比較"}]
[null,null,null,""]
[null,null,null,""]
[null,null,null,""]
{"$rows_left_out":80}
{"sheet":"(List)職務評価結果一覧","index":9,"n_rows":118,"n_cols":16,"rows_kept":118,"cut":false,"hidden":true,"merged":[]}
["職務評価結果一覧　※ 評価結果は新しいものが適用されます ※"]
[null,"評価実施日","社員No","社員タイプ","人材代替性","革新性","専門性","裁量性","対人関係の複雑さ（部門外／社外）","対人関係の複雑さ\n（部門内）","問題解決の困難度","経営への影響度",{"$f":"'職務(役割)評価'!G22","v":""},{"$f":"'職務(役割)評価'!G23","v":""},{"$f":"'職務(役割)評価'!G24","v":""},"合計"]
[null,"2020-03-30T13:18:16.280","B004","総合職",1,1,2,2,1,2,2,2,"","","",13]
[null,"2020-03-30T13:15:00.860","B005","総合職",2,1,1,2,2,2,2,2,"","","",14]
[null,"2020-03-30T13:14:59.390","B004","総合職",1,1,2,2,1,2,2,2,"","","",13]
[null,"2020-03-30T13:14:52.900","P004","総合職",2,2,1,1,1,2,1,1,"","","",11]
[null,"2020-03-30T13:14:50.020","P004","総合職",2,2,1,1,1,2,1,1,"","","",11]
[null,"2020-03-30T13:14:48","P004","(対象外)　アシスタント",2,2,1,1,1,2,1,1,"","","",11]
[null,"2020-03-30T13:14:45.840","P003","サポート",1,1,1,2,1,1,2,1,"","","",10]
[null,"2020-03-30T13:14:43.080","P002","サポート",1,2,1,1,1,1,2,2,"","","",11]
[null,"2020-03-30T13:14:41.270","P001","サポート",1,1,1,1,1,1,1,1,"","","",8]
[null,"2020-03-30T13:14:39.440",0,"サポート",2,1,2,2,2,2,1,2,"","","",14]
[null,"2020-03-30T13:14:36.470",0,"サポート",2,1,2,2,2,2,1,2,"","","",14]
[null,"2020-03-30T13:14:35.130",0,"",2,1,2,2,2,2,1,2,"","","",14]
[]
[null,"2020-03-30T13:14:14.460","P006","パート１",1,2,2,2,2,1,1,2,"","","",13]
[null,"2020-03-30T13:14:09.240","P007","パート１",2,1,1,1,1,1,1,2,"","","",10]
[null,"2020-03-30T13:14:07.590","P005","パート１",1,1,1,1,1,1,1,1,"","","",8]
[null,"2020-03-30T13:14:06.190","P007","パート１",2,1,1,1,1,1,1,2,"","","",10]
[null,"2020-03-30T13:14:02.560","P005","パート１",1,1,1,1,1,1,1,1,"","","",8]
{"$rows_left_out":98}