{"text_format":"1","workbook":"xlsx","n_sheets":10,"sheets":["目次","取組対象の選択","社員一覧の作成","職務(役割)評価","該当者抽出","(List)職務(役割)評価表","活用係数の設定","時間賃率の計算","均等・均衡待遇のチェック","(List)職務評価結果一覧"],"not_rendered":{"charts":3,"images":0,"macros":1,"external_links":0,"defined_names":11,"comments":2,"pivot_tables":0},"unopened":[],"bounds":{"document_bytes":16777216,"sheet_cells":100000,"rows_first":2000,"rows_last":500,"rows_between":2000,"halvings":0,"cell_chars":16384,"cell_head_chars":4096},"cells_cut":0,"cells_raw":0,"read":"whole","date_system":"1900"}

{"sheet":"目次","index":0,"n_rows":22,"n_cols":21,"rows_kept":22,"cut":false,"hidden":false,"merged":[[4,10,4,14],[5,10,5,14]]}
[]
["目次",null,null,null,"Step1",null,null,null,null,null,null,null,null,null,null,null,null,null,null,null,"Step3"]
[null,"職務（役割）評価をやってみましょう",null,null,null,null,null,null,null,"均等･均衡待遇が図られているか",null,null,null,null,null,null,null,"職務（役割）評価結果を活用して"]
[null,null,null,null,null,null,null,null,null,"チェックしてみましょう",null,null,null,null,null,null,null,"均等･均衡待遇を実現できる制度を"]
[]
[null,null,null,null,null,null,null,null,null,null,"※ お手元に「社員一覧」・「社員個別の基本給\n　一覧」をご準備ください",null,null,null,null,null,null,"検討してみましょう！（応用編）"]
[]
[null,null,"1.職務（役割）評価表の確認",null,null,null,null,null,null,null,null,null,null,null,null,null,null,null,"1.パートタイム労働者･有期"]
[null,null,"↓",null,null,null,null,null,null,null,null,null,null,null,null,null,null,null,"　雇用労働者の格付け（役割"]
[null,null,"2.職務（役割）評価の試行",null,null,null,null,null,null,null,null,null,null,null,null,null,null,null,"　等級）制度の設計"]
[null,null,"↓",null,null,null,null,null,null,null,null,null,null,null,null,null,null,null,"↓"]
[null,null,"3.評価結果の視覚化",null,null,null,null,null,null,null,null,null,null,null,null,null,null,null,"2.正社員の職能資格制度との"]
[null,null,null,null,null,null,null,null,null,null,null,null,null,null,null,null,null,null,"　対応関係の設定"]
[null,null,null,null,null,null,null,null,null,null,null,null,null,null,null,null,null,null,"↓"]
[null,null,null,null,null,null,null,null,null,null,null,null,null,null,null,null,null,null,"3.職務（役割）評価表の"]
[null,null,null,null,null,null,null,null,null,null,null,null,null,null,null,null,null,null,"　カスタマイズ"]
[null,null,null,null,null,null,null,null,null,null,null,null,null,null,null,null,null,null,"↓"]
[null,null,null,null,null,null,null,null,null,null,null,null,null,null,null,null,null,null,"4.職務（役割）評価の実施"]
[null,null,null,null,null,null,null,null,null,null,null,null,null,null,null,null,null,null,"↓"]
[null,null,null,null,null,null,null,null,null,null,null,null,null,null,null,null,null,null,"5.職務（役割）評価を用いた"]
[null,null,null,null,null,null,null,null,null,null,null,null,null,null,null,null,null,null,"　格付け（役割等級）制度の"]
[null,null,null,null,null,null,null,null,null,null,null,null,null,null,null,null,null,null,"　検証"]

{"sheet":"取組対象の選択","index":1,"n_rows":22,"n_cols":11,"rows_kept":22,"cut":false,"hidden":false,"merged":[]}
[]
[]
[]
[]
[]
[]
[]
[]
["取組対象の選択",null,null,"■色のセル…入力必要項目"]
[]
[null,null,null,"対象とする社員タイプ",null,null,null,null,null,1,{"$f":"IF(D12=0,\"\",D12)","v":"パート１"}]
[null,null,"取組対象①","パート１",null,null,null,null,{"$f":"IF(D12=\"\",\"\",D16)","v":"総合職"},2,{"$f":"IF(D13=0,\"\",D13)","v":"サポート"}]
[null,null,"取組対象②","サポート",null,null,null,null,{"$f":"IF(D13=\"\",\"\",D16)","v":"総合職"},3,""]
[null,null,"取組対象③",null,null,null,null,null,{"$f":"IF(D14=\"\",\"\",D16)","v":""},4,{"$f":"IF(D16=0,\"\",D16)","v":"総合職"}]
[null,null,null,null,null,null,null,null,null,5,{"$f":"IF(D19=0,\"\",\"(対象外)　\"&D19)","v":"(対象外)　アシスタント"}]
[null,null,"比較対象","総合職",null,null,null,null,null,6,{"$f":"IF(D20=0,\"\",\"(対象外)　\"&D20)","v":"(対象外)　一般職"}]
[null,null,null,null,null,null,null,null,null,7,""]
[null,null,null,"対象外の社員タイプ",null,null,null,null,null,8,""]
[null,null,null,"アシスタント",null,null,null,null,null,9,""]
[null,null,null,"一般職",null,null,null,null,null,10,""]
[]
[{"$f":"IF(C22=\"✓\",MAX($A$11:A19)+1,\"\")","v":""}]

{"sheet":"社員一覧の作成","index":2,"n_rows":26,"n_cols":4,"rows_kept":26,"cut":false,"hidden":false,"merged":[]}
[]
[]
[]
[]
[]
[]
[]
[null,"社員一覧の作成"]
[null,null,null,"■色のセル…入力必要項目"]
[]
[]
[null,"社員No.等","社員タイプ","備考・メモ"]
[null,"B001","(対象外)一般職"]
[null,"B002","(対象外)一般職"]
[null,"B003","総合職"]
[null,"B004","総合職"]
[null,"B005","総合職"]
[null,"P001","サポート"]
[null,"P002","サポート"]
[null,"P003","サポート"]
[null,"P004","サポート"]
[null,"P005","パート１"]
[null,"P006","パート１"]
[null,"P007","パート１"]
[null,"B006","総合職"]
[null,"P008","パート１"]

{"sheet":"職務(役割)評価","index":3,"n_rows":25,"n_cols":12,"rows_kept":25,"cut":false,"hidden":false,"merged":[[11,9,11,10]]}
[]
[]
[]
[]
[]
[]
[]
[null,"職務評価表の実施"]
[null,null,null,"社員タイプ"]
[null,{"$f":"NOW()","v":"2021-06-29T11:45:19.230"},{"$f":"E14","v":"B003"},4,{"$f":"VLOOKUP(D10,取組対象の選択!$J$11:$K$20,2,FALSE)","v":"総合職"}]
[null,"X",null,null,null,null,null,"","■色のセル…入力必要項目"]
[null,"X",null,"社員No.等",null,null,null,"",null,"スケール"]
[null,"X",null,3,null,"＃","評価項目","定義","ウェイト","スケール別の定義","スケール数値","ポイント"]
[null,"X",null,1,"B003",1,{"$f":"IFERROR(VLOOKUP($F14,'(List)職務(役割)評価表'!$C$10:$P$20,2,FALSE),\"\")","v":"人材代替性"},{"$f":"IFERROR(VLOOKUP($F14,'(List)職務(役割)評価表'!$C$10:$P$20,3,FALSE),\"\")","v":"採用や配置転換によって代わりの人材を探すのが難しい仕事"},1,null,2,{"$f":"IF(G14=\"\",\"\",I14*K14)","v":2}]
[null,"X",null,null,null,2,{"$f":"IFERROR(VLOOKUP($F15,'(List)職務(役割)評価表'!$C$10:$P$20,2,FALSE),\"\")","v":"革新性"},{"$f":"IFERROR(VLOOKUP($F15,'(List)職務(役割)評価表'!$C$10:$P$20,3,FALSE),\"\")","v":"現在の方法とは全く異なる新しい方法が求められる仕事"},1,null,2,{"$f":"IF(G15=\"\",\"\",I15*K15)","v":2}]
[null,"X",null,null,null,3,{"$f":"IFERROR(VLOOKUP($F16,'(List)職務(役割)評価表'!$C$10:$P$20,2,FALSE),\"\")","v":"専門性"},{"$f":"IFERROR(VLOOKUP($F16,'(List)職務(役割)評価表'!$C$10:$P$20,3,FALSE),\"\")","v":"仕事を進める上で特殊なｽｷﾙや技能が必要な仕事"},1,null,2,2]
[null,"X",null,null,null,4,{"$f":"IFERROR(VLOOKUP($F17,'(List)職務(役割)評価表'!$C$10:$P$20,2,FALSE),\"\")","v":"裁量性"},{"$f":"IFERROR(VLOOKUP($F17,'(List)職務(役割)評価表'!$C$10:$P$20,3,FALSE),\"\")","v":"従業員の裁量に任せる仕事"},1,null,2,2]
[null,"X",null,null,null,5,{"$f":"IFERROR(VLOOKUP($F18,'(List)職務(役割)評価表'!$C$10:$P$20,2,FALSE),\"\")","v":"対人関係の複雑さ（部門外／社外）"},{"$f":"IFERROR(VLOOKUP($F18,'(List)職務(役割)評価表'!$C$10:$P$20,3,FALSE),\"\")","v":"仕事を行う上で、社外の取引先や顧客、部門外との調整が多い仕事"},1,null,1,1]
[null,"X",null,null,null,6,{"$f":"IFERROR(VLOOKUP($F19,'(List)職務(役割)評価表'!$C$10:$P$20,2,FALSE),\"\")","v":"対人関係の複雑さ\n（部門内）"},{"$f":"IFERROR(VLOOKUP($F19,'(List)職務(役割)評価表'!$C$10:$P$20,3,FALSE),\"\")","v":"仕事を進める上で部門内の人材との調整が多い仕事"},1,null,1,1]
[null,"X",null,null,null,7,{"$f":"IFERROR(VLOOKUP($F20,'(List)職務(役割)評価表'!$C$10:$P$20,2,FALSE),\"\")","v":"問題解決の困難度"},{"$f":"IFERROR(VLOOKUP($F20,'(List)職務(役割)評価表'!$C$10:$P$20,3,FALSE),\"\")","v":"職務に関する課題を調査・抽出し、解決につなげる仕事"},1,null,1,1]
[null,"X",null,null,null,8,{"$f":"IFERROR(VLOOKUP($F21,'(List)職務(役割)評価表'!$C$10:$P$20,2,FALSE),\"\")","v":"経営への影響度"},{"$f":"IFERROR(VLOOKUP($F21,'(List)職務(役割)評価表'!$C$10:$P$20,3,FALSE),\"\")","v":"会社全体への業績に大きく影響する仕事"},1,null,1,1]
[null,"X",null,null,null,9,{"$f":"IFERROR(VLOOKUP($F22,'(List)職務(役割)評価表'!$C$10:$P$20,2,FALSE),\"\")","v":""},{"$f":"IFERROR(VLOOKUP($F22,'(List)職務(役割)評価表'!$C$10:$P$20,3,FALSE),\"\")","v":""},1,null,2,""]
[null,"X",null,null,null,10,{"$f":"IFERROR(VLOOKUP($F23,'(List)職務(役割)評価表'!$C$10:$P$20,2,FALSE),\"\")","v":""},{"$f":"IFERROR(VLOOKUP($F23,'(List)職務(役割)評価表'!$C$10:$P$20,3,FALSE),\"\")","v":""},null,null,0,""]
[null,"X",null,null,null,11,{"$f":"IFERROR(VLOOKUP($F24,'(List)職務(役割)評価表'!$C$10:$P$20,2,FALSE),\"\")","v":""},{"$f":"IFERROR(VLOOKUP($F24,'(List)職務(役割)評価表'!$C$10:$P$20,3,FALSE),\"\")","v":""},null,null,0,""]
[null,null,null,null,null,null,null,null,null,null,"職務ポイントの合計",{"$f":"SUM(L14:L24)","v":12}]

{"sheet":"該当者抽出","index":4,"n_rows":51,"n_cols":2,"rows_kept":51,"cut":false,"hidden":true,"merged":[]}
["＃","社員No.等"]
[1,"B003"]
[2,"B004"]
[3,"B005"]
[4,"B006"]
[5]
[6]
[7]
[8]
[9]
[10]
[11]
[12]
[13]
[14]
[15]
[16]
[17]
[18]
[19]
[20]
[21]
[22]
[23]
[24]
[25]
[26]
[27]
[28]
[29]
[30]
[31]
[32]
[33]
[34]
[35]
[36]
[37]
[38]
[39]
[40]
[41]
[42]
[43]
[44]
[45]
[46]
[47]
[48]
[49]
[50]

{"sheet":"(List)職務(役割)評価表","index":5,"n_rows":20,"n_cols":39,"rows_kept":20,"cut":false,"hidden":true,"merged":[]}
[]
[]
[]
[]
[null,null,"職務（役割）評価表のカスタマイズ"]
[]
[null,null,null,"項目","項目の定義","ウェイト","スケール",null,null,null,null,null,null,null,null,null,null,null,null,1,{"$f":"T7+1","v":2},{"$f":"U7+1","v":3},4,5,6,7,8,9,10,11]
[null,null,null,null,null,"✓","✓","✓","✓","✓","✓","✓","✓","✓","✓","✓"]
[null,"✓","＃",null,null,null,1,2,3,4,5,6,7,8,9,10,null,null,1,{"$f":"IF(TRANSPOSE($G$10:$P$20)=0,\"\",TRANSPOSE($G$10:$P$20))","v":"採用や配置転換による代替人材の確保が非常に容易な仕事"},"現在の手法をそのまま活用出来る仕事","それほど専門性が必要とされない仕事","原則として自由裁量のない仕事","部門外・社外との交渉・折衝業務がない仕事","部門内との調整作業がない仕事","既存の方法で解決出来ることが多い仕事","経営への影響度が非常に軽微な仕事","","",""]
[null,"✓",{"$f":"IF(D10=\"\",\"\",SUM(C9)+1)","v":1},"人材代替性","採用や配置転換によって代わりの人材を探すのが難しい仕事",1,"採用や配置転換による代替人材の確保が非常に容易な仕事","採用や配置転換による代替人材の確保が容易な仕事","採用や配置転換による代替人材の確保が難しい仕事","採用や配置転換による代替人材の確保が非常に難しい仕事","採用や配置転換による代替人材の確保が不可能な仕事",null,null,null,null,null,null,null,{"$f":"H9","v":2},"採用や配置転換による代替人材の確保が容易な仕事","現在の手法をかなりそのまま活用出来る仕事","担当分野において平均的な専門性が必要とされる仕事","自由裁量を行使した結果が、本人のみに影響を与える仕事","部門外・社外との交渉・折衝業務が少ない仕事","部門内との調整作業が少ない仕事","既存の方法を少しｱﾚﾝｼﾞすることで解決出来ることが多い仕事","経営への影響度が軽微な仕事","","","",null,"人材代替性","採用や配置転換によって代わりの人材を探すのが難しい仕事",1,"採用や配置転換による代替人材の確保が非常に容易な仕事","採用や配置転換による代替人材の確保が容易な仕事","採用や配置転換による代替人材の確保が難しい仕事","採用や配置転換による代替人材の確保が非常に難しい仕事","採用や配置転換による代替人材の確保が不可能な仕事"]
[null,"✓",{"$f":"IF(D11=\"\",\"\",SUM(C10)+1)","v":2},"革新性","現在の方法とは全く異なる新しい方法が求められる仕事",1,"現在の手法をそのまま活用出来る仕事","現在の手法をかなりそのまま活用出来る仕事","現在の手法をある程度活用出来る仕事","現在の手法を参考程度にしながら、異なるものが求められる仕事","現在の手法と全く異なるものが求められる仕事",null,null,null,null,null,null,null,{"$f":"I9","v":3},"採用や配置転換による代替人材の確保が難しい仕事","現在の手法をある程度活用出来る仕事","担当分野において高い専門性が必要とされる仕事","自由裁量を行使した結果が、当該部門の一部に影響を与える仕事","部門外・社外との交渉・折衝業務がやや多い仕事","部門内との調整作業がやや多い仕事","既存の方法を大きくｱﾚﾝｼﾞすることで解決出来ることが多い仕事","経営への影響度がやや大きな仕事","","","",null,"革新性","現在の方法とは全く異なる新しい方法が求められる仕事",1,"現在の手法をそのまま活用出来る仕事","現在の手法をかなりそのまま活用出来る仕事","現在の手法をある程度活用出来る仕事","現在の手法を参考程度にしながら、異なるものが求められる仕事","現在の手法と全く異なるものが求められる仕事"]
[null,"✓",3,"専門性","仕事を進める上で特殊なｽｷﾙや技能が必要な仕事",1,"それほど専門性が必要とされない仕事","担当分野において平均的な専門性が必要とされる仕事","担当分野において高い専門性が必要とされる仕事","担当分野において高い専門性が必要とされ、かつその周辺分野においても平均的な専門性が必要とされる仕事","担当分野において高い専門性が必要とされ、かつその周辺分野においても高い専門性が必要とされる仕事",null,null,null,null,null,null,null,{"$f":"J9","v":4},"採用や配置転換による代替人材の確保が非常に難しい仕事","現在の手法を参考程度にしながら、異なるものが求められる仕事","担当分野において高い専門性が必要とされ、かつその周辺分野においても平均的な専門性が必要とされる仕事","自由裁量を行使した結果が、当該部門全体に影響を与える仕事","部門外・社外との交渉・折衝業務が多い仕事","部門内との調整作業が多い仕事","既存の方法を参考にしつつも、新しい方法を用いなければ解決出来ないことが多い仕事","経営への影響度が大きな仕事","","","",null,"専門性","仕事を進める上で特殊なｽｷﾙや技能が必要な仕事",1,"それほど専門性が必要とされない仕事","担当分野において平均的な専門性が必要とされる仕事","担当分野において高い専門性が必要とされる仕事","担当分野において高い専門性が必要とされ、かつその周辺分野においても平均的な専門性が必要とされる仕事","担当分野において高い専門性が必要とされ、かつその周辺分野においても高い専門性が必要とされる仕事"]
[null,"✓",4,"裁量性","従業員の裁量に任せる仕事",1,"原則として自由裁量のない仕事","自由裁量を行使した結果が、本人のみに影響を与える仕事","自由裁量を行使した結果が、当該部門の一部に影響を与える仕事","自由裁量を行使した結果が、当該部門全体に影響を与える仕事","自由裁量を行使した結果が、企業全体に影響を与える仕事",null,null,null,null,null,null,null,{"$f":"K9","v":5},"採用や配置転換による代替人材の確保が不可能な仕事","現在の手法と全く異なるものが求められる仕事","担当分野において高い専門性が必要とされ、かつその周辺分野においても高い専門性が必要とされる仕事","自由裁量を行使した結果が、企業全体に影響を与える仕事","部門外・社外との交渉・折衝業務が非常に多い仕事","部門内との調整作業が非常に多い仕事","最初から新しい方法を用いなければ解決出来ない仕事","経営への影響度が非常に大きな仕事","","","",null,"裁量性","従業員の裁量に任せる仕事",1,"原則として自由裁量のない仕事","自由裁量を行使した結果が、本人のみに影響を与える仕事","自由裁量を行使した結果が、当該部門の一部に影響を与える仕事","自由裁量を行使した結果が、当該部門全体に影響を与える仕事","自由裁量を行使した結果が、企業全体に影響を与える仕事"]
[null,"✓",5,"対人関係の複雑さ（部門外／社外）","仕事を行う上で、社外の取引先や顧客、部門外との調整が多い仕事",1,"部門外・社外との交渉・折衝業務がない仕事","部門外・社外との交渉・折衝業務が少ない仕事","部門外・社外との交渉・折衝業務がやや多い仕事","部門外・社外との交渉・折衝業務が多い仕事","部門外・社外との交渉・折衝業務が非常に多い仕事",null,null,null,null,null,null,null,{"$f":"L9","v":6},"","","","","","","","","","","",null,"対人関係の複雑さ（部門外／社外）","仕事を行う上で、社外の取引先や顧客、部門外との調整が多い仕事",1,"部門外・社外との交渉・折衝業務がない仕事","部門外・社外との交渉・折衝業務が少ない仕事","部門外・社外との交渉・折衝業務がやや多い仕事","部門外・社外との交渉・折衝業務が多い仕事","部門外・社外との交渉・折衝業務が非常に多い仕事"]
[null,"✓",6,"対人関係の複雑さ\n（部門内）","仕事を進める上で部門内の人材との調整が多い仕事",1,"部門内との調整作業がない仕事","部門内との調整作業が少ない仕事","部門内との調整作業がやや多い仕事","部門内との調整作業が多い仕事","部門内との調整作業が非常に多い仕事",null,null,null,null,null,null,null,{"$f":"M9","v":7},"","","","","","","","","","","",null,"対人関係の複雑さ\n（部門内）","仕事を進める上で部門内の人材との調整が多い仕事",1,"部門内との調整作業がない仕事","部門内との調整作業が少ない仕事","部門内との調整作業がやや多い仕事","部門内との調整作業が多い仕事","部門内との調整作業が非常に多い仕事"]
[null,"✓",7,"問題解決の困難度","職務に関する課題を調査・抽出し、解決につなげる仕事",1,"既存の方法で解決出来ることが多い仕事","既存の方法を少しｱﾚﾝｼﾞすることで解決出来ることが多い仕事","既存の方法を大きくｱﾚﾝｼﾞすることで解決出来ることが多い仕事","既存の方法を参考にしつつも、新しい方法を用いなければ解決出来ないことが多い仕事","最初から新しい方法を用いなければ解決出来ない仕事",null,null,null,null,null,null,null,{"$f":"N9","v":8},"","","","","","","","","","","",null,"問題解決の困難度","職務に関する課題を調査・抽出し、解決につなげる仕事",1,"既存の方法で解決出来ることが多い仕事","既存の方法を少しｱﾚﾝｼﾞすることで解決出来ることが多い仕事","既存の方法を大きくｱﾚﾝｼﾞすることで解決出来ることが多い仕事","既存の方法を参考にしつつも、新しい方法を用いなければ解決出来ないことが多い仕事","最初から新しい方法を用いなければ解決出来ない仕事"]
[null,"✓",8,"経営への影響度","会社全体への業績に大きく影響する仕事",1,"経営への影響度が非常に軽微な仕事","経営への影響度が軽微な仕事","経営への影響度がやや大きな仕事","経営への影響度が大きな仕事","経営への影響度が非常に大きな仕事",null,null,null,null,null,null,null,{"$f":"O9","v":9},"","","","","","","","","","","",null,"経営への影響度","会社全体への業績に大きく影響する仕事",1,"経営への影響度が非常に軽微な仕事","経営への影響度が軽微な仕事","経営への影響度がやや大きな仕事","経営への影響度が大きな仕事","経営への影響度が非常に大きな仕事"]
[null,null,"",null,null,null,null,null,null,null,null,null,null,null,null,null,null,null,{"$f":"P9","v":10},"","","","","","","","","","",""]
[null,null,""]
[null,null,""]

{"sheet":"活用係数の設定","index":6,"n_rows":58,"n_cols":13,"rows_kept":58,"cut":false,"hidden":false,"merged":[[51,9,51,11],[52,9,52,11],[53,9,53,11],[55,7,55,8],[35,9,35,11],[36,9,36,11],[38,7,38,8],[45,4,45,5],[46,4,46,5],[12,4,12,5],[11,4,11,5],[28,4,28,5],[29,4,29,5],[34,9,34,11],[17,9,17,11],[18,9,18,11],[19,9,19,11],[21,7,21,8]]}
[]
[]
[]
[]
[]
[]
[]
[]
[]
["活用係数の設定",null,null,null,null,null,"■色のセル…入力必要項目"]
[]
[null,null,null,"取組対象①：",{"$f":"IF(取組対象の選択!D12=0,\"\",取組対象の選択!D12)","v":"パート１"},null,{"$f":"IF(E12=\"\",\"\",H24)","v":0.9}]
[null,null,null,"比較対象：",{"$f":"IF(取組対象の選択!I12=0,\"\",取組対象の選択!I12)","v":"総合職"}]
[]
[null,{"$f":"\"人材活用の仕組みや運用\"","v":"人材活用の仕組みや運用"}]
[]
[null,null,null,null,null,null,null,"ある/ない",null,null,"備考"]
[null,"・転居を伴う配置転換等、働く場所の変更可能性に差が------------>",null,null,null,null,null,"ある",null,"正社員は全国転勤ありだが、エキスパートは地域限定",null,null,"設定しない"]
[null,"・職務や職種の変更など、従事する仕事の変更可能性に差が------->",null,null,null,null,null,"ない",null,"どちらも職種変更はない",null,null,"設定する"]
[null,"・時間外、休日労働、深夜勤務等、労働時間の変更可能性に差が-->",null,null,null,null,null,"ない",null,"どちらも時間外等の違いはない",null,null,1]
[null,null,null,null,null,null,null,null,null,null,null,null,2]
[null,null,null,null,null,null,{"$f":"\"　上記等を踏まえて、\"&$E$12&\"に活用係数を-->\"","v":"　上記等を踏まえて、パート１に活用係数を-->"},"設定する",null,null,null,null,{"$f":"IF(M21=1,1,\"\")","v":""}]
[]
[null,null,null,null,null,null,{"$f":"E12&\"の活用係数：\"","v":"パート１の活用係数："},0.9,"←0.00より大きく1.00未満の数値を記入",null,null,null,{"$f":"IF($H$22=\"設定しない\",1,H24)","v":0.9}]
[]
[]
[]
[]
[null,null,null,"取組対象②：",{"$f":"IF(取組対象の選択!D13=0,\"\",取組対象の選択!D13)","v":"サポート"},null,{"$f":"IF(E29=\"\",\"\",H41)","v":0.8}]
[null,null,null,"比較対象：",{"$f":"IF(取組対象の選択!I13=0,\"\",取組対象の選択!I13)","v":"総合職"}]
[]
[null,{"$f":"\"人材活用の仕組みや運用\"","v":"人材活用の仕組みや運用"}]
[]
[null,null,null,null,null,null,null,"ある/ない",null,null,"備考"]
[null,"・転居を伴う配置転換等、働く場所の変更可能性に差が------------>",null,null,null,null,null,"ない",null,null,null,null,"設定しない"]
[null,"・職務や職種の変更など、従事する仕事の変更可能性に差が------->",null,null,null,null,null,"ない",null,null,null,null,"設定する"]
[null,"・時間外、休日労働、深夜勤務等、労働時間の変更可能性に差が-->",null,null,null,null,null,"ある",null,"シフト通りの出勤",null,null,1]
[null,null,null,null,null,null,null,null,null,null,null,null,2]
[null,null,null,null,null,null,{"$f":"\"　上記等を踏まえて、\"&$E$12&\"に活用係数を-->\"","v":"　上記等を踏まえて、パート１に活用係数を-->"},"設定する",null,null,null,null,{"$f":"IF(M38=1,1,\"\")","v":""}]
[]
[null,null,null,null,null,null,{"$f":"E29&\"の活用係数：\"","v":"サポートの活用係数："},0.8,"←0.00より大きく1.00未満の数値を記入",null,null,null,{"$f":"IF($H$22=\"設定しない\",1,H41)","v":0.8}]
[]
[]
[]
[]
[null,null,null,"取組対象③：",{"$f":"IF(取組対象の選択!D14=0,\"\",取組対象の選択!D14)","v":""},null,{"$f":"IF(E46=\"\",\"\",H58)","v":""}]
[null,null,null,"比較対象：",{"$f":"IF(取組対象の選択!I14=0,\"\",取組対象の選択!I14)","v":""}]
[]
[null,{"$f":"\"人材活用の仕組みや運用\"","v":"人材活用の仕組みや運用"}]
[]
[null,null,null,null,null,null,null,"ある/ない",null,null,"備考"]
[null,"・転居を伴う配置転換等、働く場所の変更可能性に差が------------>",null,null,null,null,null,"ある",null,null,null,null,"設定しない"]
[null,"・職務や職種の変更など、従事する仕事の変更可能性に差が------->",null,null,null,null,null,"ある",null,null,null,null,"設定する"]
[null,"・時間外、休日労働、深夜勤務等、労働時間の変更可能性に差が-->",null,null,null,null,null,"ある",null,null,null,null,1]
[null,null,null,null,null,null,null,null,null,null,null,null,2]
[null,null,null,null,null,null,{"$f":"\"　上記等を踏まえて、\"&$E$12&\"に活用係数を-->\"","v":"　上記等を踏まえて、パート１に活用係数を-->"},"設定する",null,null,null,null,{"$f":"IF(M55=1,1,\"\")","v":""}]
[]
[null,null,null,null,null,null,{"$f":"E46&\"の活用係数：\"","v":"の活用係数："},0.7,"←0.00より大きく1.00未満の数値を記入",null,null,null,{"$f":"IF($H$22=\"設定しない\",1,H58)","v":0.7}]

{"sheet":"時間賃率の計算","index":7,"n_rows":65,"n_cols":9,"rows_kept":65,"cut":false,"hidden":false,"merged":[]}
[]
[]
[]
[]
[]
[]
[]
[null,null,null,null,"時間賃率の計算"]
[null,null,null,null,"■色のセル…入力必要項目"]
[]
[]
[null,"社員No.等","社員タイプ","職務（役割）\nポイント","時間賃率\n（活用係数反映前）","時間賃率（活用係数反映後）取組対象①との比較","時間賃率（活用係数反映後）取組対象②の比較","時間賃率（活用係数反映後）取組対象③との比較","備考・メモ"]
[null,{"$f":"IF(社員一覧の作成!B13=\"\",\"\",社員一覧の作成!B13)","v":"B001"},{"$f":"IF(社員一覧の作成!C13=\"\",\"\",社員一覧の作成!C13)","v":"(対象外)一般職"},8,1000,{"$f":"IF(取組対象の選択!$D$12=\"\",\"\",IF(C13=\"\",\"\",IF(C13=活用係数の設定!$E$13,活用係数の設定!$H$24*E13,\"\")))","v":""},{"$f":"IF(取組対象の選択!$D$13=\"\",\"\",IF(C13=\"\",\"\",IF(C13=活用係数の設定!$E$30,活用係数の設定!$H$41*E13,\"\")))","v":""},{"$f":"IF(取組対象の選択!$D$14=\"\",\"\",IF(C13=\"\",\"\",IF(C13=活用係数の設定!$E$47,活用係数の設定!$H$58*E13,\"\")))","v":""},{"$f":"IF(社員一覧の作成!D13=\"\",\"\",社員一覧の作成!D13)","v":""}]
[null,{"$f":"IF(社員一覧の作成!B14=\"\",\"\",社員一覧の作成!B14)","v":"B002"},{"$f":"IF(社員一覧の作成!C14=\"\",\"\",社員一覧の作成!C14)","v":"(対象外)一般職"},11,1200,{"$f":"IF(取組対象の選択!$D$12=\"\",\"\",IF(C14=\"\",\"\",IF(C14=活用係数の設定!$E$13,活用係数の設定!$H$24*E14,\"\")))","v":""},{"$f":"IF(取組対象の選択!$D$13=\"\",\"\",IF(C14=\"\",\"\",IF(C14=活用係数の設定!$E$30,活用係数の設定!$H$41*E14,\"\")))","v":""},{"$f":"IF(取組対象の選択!$D$14=\"\",\"\",IF(C14=\"\",\"\",IF(C14=活用係数の設定!$E$47,活用係数の設定!$H$58*E14,\"\")))","v":""},{"$f":"IF(社員一覧の作成!D14=\"\",\"\",社員一覧の作成!D14)","v":""}]
[null,{"$f":"IF(社員一覧の作成!B15=\"\",\"\",社員一覧の作成!B15)","v":"B003"},{"$f":"IF(社員一覧の作成!C15=\"\",\"\",社員一覧の作成!C15)","v":"総合職"},14,1300,{"$f":"IF(取組対象の選択!$D$12=\"\",\"\",IF(C15=\"\",\"\",IF(C15=活用係数の設定!$E$13,活用係数の設定!$H$24*E15,\"\")))","v":1170},{"$f":"IF(取組対象の選択!$D$13=\"\",\"\",IF(C15=\"\",\"\",IF(C15=活用係数の設定!$E$30,活用係数の設定!$H$41*E15,\"\")))","v":1040},{"$f":"IF(取組対象の選択!$D$14=\"\",\"\",IF(C15=\"\",\"\",IF(C15=活用係数の設定!$E$47,活用係数の設定!$H$58*E15,\"\")))","v":""},{"$f":"IF(社員一覧の作成!D15=\"\",\"\",社員一覧の作成!D15)","v":""}]
[null,{"$f":"IF(社員一覧の作成!B16=\"\",\"\",社員一覧の作成!B16)","v":"B004"},{"$f":"IF(社員一覧の作成!C16=\"\",\"\",社員一覧の作成!C16)","v":"総合職"},13,1500,{"$f":"IF(取組対象の選択!$D$12=\"\",\"\",IF(C16=\"\",\"\",IF(C16=活用係数の設定!$E$13,活用係数の設定!$H$24*E16,\"\")))","v":1350},{"$f":"IF(取組対象の選択!$D$13=\"\",\"\",IF(C16=\"\",\"\",IF(C16=活用係数の設定!$E$30,活用係数の設定!$H$41*E16,\"\")))","v":1200},{"$f":"IF(取組対象の選択!$D$14=\"\",\"\",IF(C16=\"\",\"\",IF(C16=活用係数の設定!$E$47,活用係数の設定!$H$58*E16,\"\")))","v":""},{"$f":"IF(社員一覧の作成!D16=\"\",\"\",社員一覧の作成!D16)","v":""}]
[null,{"$f":"IF(社員一覧の作成!B17=\"\",\"\",社員一覧の作成!B17)","v":"B005"},{"$f":"IF(社員一覧の作成!C17=\"\",\"\",社員一覧の作成!C17)","v":"総合職"},14,1550,{"$f":"IF(取組対象の選択!$D$12=\"\",\"\",IF(C17=\"\",\"\",IF(C17=活用係数の設定!$E$13,活用係数の設定!$H$24*E17,\"\")))","v":1395},{"$f":"IF(取組対象の選択!$D$13=\"\",\"\",IF(C17=\"\",\"\",IF(C17=活用係数の設定!$E$30,活用係数の設定!$H$41*E17,\"\")))","v":1240},{"$f":"IF(取組対象の選択!$D$14=\"\",\"\",IF(C17=\"\",\"\",IF(C17=活用係数の設定!$E$47,活用係数の設定!$H$58*E17,\"\")))","v":""},{"$f":"IF(社員一覧の作成!D17=\"\",\"\",社員一覧の作成!D17)","v":""}]
[null,{"$f":"IF(社員一覧の作成!B18=\"\",\"\",社員一覧の作成!B18)","v":"P001"},{"$f":"IF(社員一覧の作成!C18=\"\",\"\",社員一覧の作成!C18)","v":"サポート"},8,900,{"$f":"IF(取組対象の選択!$D$12=\"\",\"\",IF(C18=\"\",\"\",IF(C18=活用係数の設定!$E$13,活用係数の設定!$H$24*E18,\"\")))","v":""},{"$f":"IF(取組対象の選択!$D$13=\"\",\"\",IF(C18=\"\",\"\",IF(C18=活用係数の設定!$E$30,活用係数の設定!$H$41*E18,\"\")))","v":""},{"$f":"IF(取組対象の選択!$D$14=\"\",\"\",IF(C18=\"\",\"\",IF(C18=活用係数の設定!$E$47,活用係数の設定!$H$58*E18,\"\")))","v":""},{"$f":"IF(社員一覧の作成!D18=\"\",\"\",社員一覧の作成!D18)","v":""}]
[null,{"$f":"IF(社員一覧の作成!B19=\"\",\"\",社員一覧の作成!B19)","v":"P002"},{"$f":"IF(社員一覧の作成!C19=\"\",\"\",社員一覧の作成!C19)","v":"サポート"},11,1000,{"$f":"IF(取組対象の選択!$D$12=\"\",\"\",IF(C19=\"\",\"\",IF(C19=活用係数の設定!$E$13,活用係数の設定!$H$24*E19,\"\")))","v":""},{"$f":"IF(取組対象の選択!$D$13=\"\",\"\",IF(C19=\"\",\"\",IF(C19=活用係数の設定!$E$30,活用係数の設定!$H$41*E19,\"\")))","v":""},{"$f":"IF(取組対象の選択!$D$14=\"\",\"\",IF(C19=\"\",\"\",IF(C19=活用係数の設定!$E$47,活用係数の設定!$H$58*E19,\"\")))","v":""},{"$f":"IF(社員一覧の作成!D19=\"\",\"\",社員一覧の作成!D19)","v":""}]
[null,{"$f":"IF(社員一覧の作成!B20=\"\",\"\",社員一覧の作成!B20)","v":"P003"},{"$f":"IF(社員一覧の作成!C20=\"\",\"\",社員一覧の作成!C20)","v":"サポート"},10,900,{"$f":"IF(取組対象の選択!$D$12=\"\",\"\",IF(C20=\"\",\"\",IF(C20=活用係数の設定!$E$13,活用係数の設定!$H$24*E20,\"\")))","v":""},{"$f":"IF(取組対象の選択!$D$13=\"\",\"\",IF(C20=\"\",\"\",IF(C20=活用係数の設定!$E$30,活用係数の設定!$H$41*E20,\"\")))","v":""},{"$f":"IF(取組対象の選択!$D$14=\"\",\"\",IF(C20=\"\",\"\",IF(C20=活用係数の設定!$E$47,活用係数の設定!$H$58*E20,\"\")))","v":""},{"$f":"IF(社員一覧の作成!D20=\"\",\"\",社員一覧の作成!D20)","v":""}]
[null,{"$f":"IF(社員一覧の作成!B21=\"\",\"\",社員一覧の作成!B21)","v":"P004"},{"$f":"IF(社員一覧の作成!C21=\"\",\"\",社員一覧の作成!C21)","v":"サポート"},11,1100,{"$f":"IF(取組対象の選択!$D$12=\"\",\"\",IF(C21=\"\",\"\",IF(C21=活用係数の設定!$E$13,活用係数の設定!$H$24*E21,\"\")))","v":""},{"$f":"IF(取組対象の選択!$D$13=\"\",\"\",IF(C21=\"\",\"\",IF(C21=活用係数の設定!$E$30,活用係数の設定!$H$41*E21,\"\")))","v":""},{"$f":"IF(取組対象の選択!$D$14=\"\",\"\",IF(C21=\"\",\"\",IF(C21=活用係数の設定!$E$47,活用係数の設定!$H$58*E21,\"\")))","v":""},{"$f":"IF(社員一覧の作成!D21=\"\",\"\",社員一覧の作成!D21)","v":""}]
[null,{"$f":"IF(社員一覧の作成!B22=\"\",\"\",社員一覧の作成!B22)","v":"P005"},{"$f":"IF(社員一覧の作成!C22=\"\",\"\",社員一覧の作成!C22)","v":"パート１"},8,990,{"$f":"IF(取組対象の選択!$D$12=\"\",\"\",IF(C22=\"\",\"\",IF(C22=活用係数の設定!$E$13,活用係数の設定!$H$24*E22,\"\")))","v":""},{"$f":"IF(取組対象の選択!$D$13=\"\",\"\",IF(C22=\"\",\"\",IF(C22=活用係数の設定!$E$30,活用係数の設定!$H$41*E22,\"\")))","v":""},{"$f":"IF(取組対象の選択!$D$14=\"\",\"\",IF(C22=\"\",\"\",IF(C22=活用係数の設定!$E$47,活用係数の設定!$H$58*E22,\"\")))","v":""},{"$f":"IF(社員一覧の作成!D22=\"\",\"\",社員一覧の作成!D22)","v":""}]
[null,{"$f":"IF(社員一覧の作成!B23=\"\",\"\",社員一覧の作成!B23)","v":"P006"},{"$f":"IF(社員一覧の作成!C23=\"\",\"\",社員一覧の作成!C23)","v":"パート１"},13,1300,{"$f":"IF(取組対象の選択!$D$12=\"\",\"\",IF(C23=\"\",\"\",IF(C23=活用係数の設定!$E$13,活用係数の設定!$H$24*E23,\"\")))","v":""},{"$f":"IF(取組対象の選択!$D$13=\"\",\"\",IF(C23=\"\",\"\",IF(C23=活用係数の設定!$E$30,活用係数の設定!$H$41*E23,\"\")))","v":""},{"$f":"IF(取組対象の選択!$D$14=\"\",\"\",IF(C23=\"\",\"\",IF(C23=活用係数の設定!$E$47,活用係数の設定!$H$58*E23,\"\")))","v":""},{"$f":"IF(社員一覧の作成!D23=\"\",\"\",社員一覧の作成!D23)","v":""}]
[null,{"$f":"IF(社員一覧の作成!B24=\"\",\"\",社員一覧の作成!B24)","v":"P007"},{"$f":"IF(社員一覧の作成!C24=\"\",\"\",社員一覧の作成!C24)","v":"パート１"},10,1050,{"$f":"IF(取組対象の選択!$D$12=\"\",\"\",IF(C24=\"\",\"\",IF(C24=活用係数の設定!$E$13,活用係数の設定!$H$24*E24,\"\")))","v":""},{"$f":"IF(取組対象の選択!$D$13=\"\",\"\",IF(C24=\"\",\"\",IF(C24=活用係数の設定!$E$30,活用係数の設定!$H$41*E24,\"\")))","v":""},{"$f":"IF(取組対象の選択!$D$14=\"\",\"\",IF(C24=\"\",\"\",IF(C24=活用係数の設定!$E$47,活用係数の設定!$H$58*E24,\"\")))","v":""},{"$f":"IF(社員一覧の作成!D24=\"\",\"\",社員一覧の作成!D24)","v":""}]
[null,{"$f":"IF(社員一覧の作成!B25=\"\",\"\",社員一覧の作成!B25)","v":"B006"},{"$f":"IF(社員一覧の作成!C25=\"\",\"\",社員一覧の作成!C25)","v":"総合職"},15,1600,{"$f":"IF(取組対象の選択!$D$12=\"\",\"\",IF(C25=\"\",\"\",IF(C25=活用係数の設定!$E$13,活用係数の設定!$H$24*E25,\"\")))","v":1440},{"$f":"IF(取組対象の選択!$D$13=\"\",\"\",IF(C25=\"\",\"\",IF(C25=活用係数の設定!$E$30,活用係数の設定!$H$41*E25,\"\")))","v":1280},{"$f":"IF(取組対象の選択!$D$14=\"\",\"\",IF(C25=\"\",\"\",IF(C25=活用係数の設定!$E$47,活用係数の設定!$H$58*E25,\"\")))","v":""},{"$f":"IF(社員一覧の作成!D25=\"\",\"\",社員一覧の作成!D25)","v":""}]
[null,{"$f":"IF(社員一覧の作成!B26=\"\",\"\",社員一覧の作成!B26)","v":"P008"},{"$f":"IF(社員一覧の作成!C26=\"\",\"\",社員一覧の作成!C26)","v":"パート１"},15,1400,{"$f":"IF(取組対象の選択!$D$12=\"\",\"\",IF(C26=\"\",\"\",IF(C26=活用係数の設定!$E$13,活用係数の設定!$H$24*E26,\"\")))","v":""},{"$f":"IF(取組対象の選択!$D$13=\"\",\"\",IF(C26=\"\",\"\",IF(C26=活用係数の設定!$E$30,活用係数の設定!$H$41*E26,\"\")))","v":""},{"$f":"IF(取組対象の選択!$D$14=\"\",\"\",IF(C26=\"\",\"\",IF(C26=活用係数の設定!$E$47,活用係数の設定!$H$58*E26,\"\")))","v":""},{"$f":"IF(社員一覧の作成!D26=\"\",\"\",社員一覧の作成!D26)","v":""}]
[null,{"$f":"IF(社員一覧の作成!B27=\"\",\"\",社員一覧の作成!B27)","v":""},{"$f":"IF(社員一覧の作成!C27=\"\",\"\",社員一覧の作成!C27)","v":""},"",null,{"$f":"IF(取組対象の選択!$D$12=\"\",\"\",IF(C27=\"\",\"\",IF(C27=活用係数の設定!$E$13,活用係数の設定!$H$24*E27,\"\")))","v":""},{"$f":"IF(取組対象の選択!$D$13=\"\",\"\",IF(C27=\"\",\"\",IF(C27=活用係数の設定!$E$30,活用係数の設定!$H$41*E27,\"\")))","v":""},{"$f":"IF(取組対象の選択!$D$14=\"\",\"\",IF(C27=\"\",\"\",IF(C27=活用係数の設定!$E$47,活用係数の設定!$H$58*E27,\"\")))","v":""},{"$f":"IF(社員一覧の作成!D27=\"\",\"\",社員一覧の作成!D27)","v":""}]
[null,{"$f":"IF(社員一覧の作成!B28=\"\",\"\",社員一覧の作成!B28)","v":""},{"$f":"IF(社員一覧の作成!C28=\"\",\"\",社員一覧の作成!C28)","v":""},"",null,{"$f":"IF(取組対象の選択!$D$12=\"\",\"\",IF(C28=\"\",\"\",IF(C28=活用係数の設定!$E$13,活用係数の設定!$H$24*E28,\"\")))","v":""},{"$f":"IF(取組対象の選択!$D$13=\"\",\"\",IF(C28=\"\",\"\",IF(C28=活用係数の設定!$E$30,活用係数の設定!$H$41*E28,\"\")))","v":""},{"$f":"IF(取組対象の選択!$D$14=\"\",\"\",IF(C28=\"\",\"\",IF(C28=活用係数の設定!$E$47,活用係数の設定!$H$58*E28,\"\")))","v":""},{"$f":"IF(社員一覧の作成!D28=\"\",\"\",社員一覧の作成!D28)","v":""}]
[null,{"$f":"IF(社員一覧の作成!B29=\"\",\"\",社員一覧の作成!B29)","v":""},{"$f":"IF(社員一覧の作成!C29=\"\",\"\",社員一覧の作成!C29)","v":""},"",null,{"$f":"IF(取組対象の選択!$D$12=\"\",\"\",IF(C29=\"\",\"\",IF(C29=活用係数の設定!$E$13,活用係数の設定!$H$24*E29,\"\")))","v":""},{"$f":"IF(取組対象の選択!$D$13=\"\",\"\",IF(C29=\"\",\"\",IF(C29=活用係数の設定!$E$30,活用係数の設定!$H$41*E29,\"\")))","v":""},{"$f":"IF(取組対象の選択!$D$14=\"\",\"\",IF(C29=\"\",\"\",IF(C29=活用係数の設定!$E$47,活用係数の設定!$H$58*E29,\"\")))","v":""},{"$f":"IF(社員一覧の作成!D29=\"\",\"\",社員一覧の作成!D29)","v":""}]
[null,{"$f":"IF(社員一覧の作成!B30=\"\",\"\",社員一覧の作成!B30)","v":""},{"$f":"IF(社員一覧の作成!C30=\"\",\"\",社員一覧の作成!C30)","v":""},"",null,{"$f":"IF(取組対象の選択!$D$12=\"\",\"\",IF(C30=\"\",\"\",IF(C30=活用係数の設定!$E$13,活用係数の設定!$H$24*E30,\"\")))","v":""},{"$f":"IF(取組対象の選択!$D$13=\"\",\"\",IF(C30=\"\",\"\",IF(C30=活用係数の設定!$E$30,活用係数の設定!$H$41*E30,\"\")))","v":""},{"$f":"IF(取組対象の選択!$D$14=\"\",\"\",IF(C30=\"\",\"\",IF(C30=活用係数の設定!$E$47,活用係数の設定!$H$58*E30,\"\")))","v":""},{"$f":"IF(社員一覧の作成!D30=\"\",\"\",社員一覧の作成!D30)","v":""}]
[null,{"$f":"IF(社員一覧の作成!B31=\"\",\"\",社員一覧の作成!B31)","v":""},{"$f":"IF(社員一覧の作成!C31=\"\",\"\",社員一覧の作成!C31)","v":""},"",null,{"$f":"IF(取組対象の選択!$D$12=\"\",\"\",IF(C31=\"\",\"\",IF(C31=活用係数の設定!$E$13,活用係数の設定!$H$24*E31,\"\")))","v":""},{"$f":"IF(取組対象の選択!$D$13=\"\",\"\",IF(C31=\"\",\"\",IF(C31=活用係数の設定!$E$30,活用係数の設定!$H$41*E31,\"\")))","v":""},{"$f":"IF(取組対象の選択!$D$14=\"\",\"\",IF(C31=\"\",\"\",IF(C31=活用係数の設定!$E$47,活用係数の設定!$H$58*E31,\"\")))","v":""},{"$f":"IF(社員一覧の作成!D31=\"\",\"\",社員一覧の作成!D31)","v":""}]
[null,{"$f":"IF(社員一覧の作成!B32=\"\",\"\",社員一覧の作成!B32)","v":""},{"$f":"IF(社員一覧の作成!C32=\"\",\"\",社員一覧の作成!C32)","v":""},"",null,{"$f":"IF(取組対象の選択!$D$12=\"\",\"\",IF(C32=\"\",\"\",IF(C32=活用係数の設定!$E$13,活用係数の設定!$H$24*E32,\"\")))","v":""},{"$f":"IF(取組対象の選択!$D$13=\"\",\"\",IF(C32=\"\",\"\",IF(C32=活用係数の設定!$E$30,活用係数の設定!$H$41*E32,\"\")))","v":""},{"$f":"IF(取組対象の選択!$D$14=\"\",\"\",IF(C32=\"\",\"\",IF(C32=活用係数の設定!$E$47,活用係数の設定!$H$58*E32,\"\")))","v":""},{"$f":"IF(社員一覧の作成!D32=\"\",\"\",社員一覧の作成!D32)","v":""}]
[null,{"$f":"IF(社員一覧の作成!B33=\"\",\"\",社員一覧の作成!B33)","v":""},{"$f":"IF(社員一覧の作成!C33=\"\",\"\",社員一覧の作成!C33)","v":""},"",null,{"$f":"IF(取組対象の選択!$D$12=\"\",\"\",IF(C33=\"\",\"\",IF(C33=活用係数の設定!$E$13,活用係数の設定!$H$24*E33,\"\")))","v":""},{"$f":"IF(取組対象の選択!$D$13=\"\",\"\",IF(C33=\"\",\"\",IF(C33=活用係数の設定!$E$30,活用係数の設定!$H$41*E33,\"\")))","v":""},{"$f":"IF(取組対象の選択!$D$14=\"\",\"\",IF(C33=\"\",\"\",IF(C33=活用係数の設定!$E$47,活用係数の設定!$H$58*E33,\"\")))","v":""},{"$f":"IF(社員一覧の作成!D33=\"\",\"\",社員一覧の作成!D33)","v":""}]
[null,{"$f":"IF(社員一覧の作成!B34=\"\",\"\",社員一覧の作成!B34)","v":""},{"$f":"IF(社員一覧の作成!C34=\"\",\"\",社員一覧の作成!C34)","v":""},"",null,{"$f":"IF(取組対象の選択!$D$12=\"\",\"\",IF(C34=\"\",\"\",IF(C34=活用係数の設定!$E$13,活用係数の設定!$H$24*E34,\"\")))","v":""},{"$f":"IF(取組対象の選択!$D$13=\"\",\"\",IF(C34=\"\",\"\",IF(C34=活用係数の設定!$E$30,活用係数の設定!$H$41*E34,\"\")))","v":""},{"$f":"IF(取組対象の選択!$D$14=\"\",\"\",IF(C34=\"\",\"\",IF(C34=活用係数の設定!$E$47,活用係数の設定!$H$58*E34,\"\")))","v":""},{"$f":"IF(社員一覧の作成!D34=\"\",\"\",社員一覧の作成!D34)","v":""}]
[null,{"$f":"IF(社員一覧の作成!B35=\"\",\"\",社員一覧の作成!B35)","v":""},{"$f":"IF(社員一覧の作成!C35=\"\",\"\",社員一覧の作成!C35)","v":""},"",null,{"$f":"IF(取組対象の選択!$D$12=\"\",\"\",IF(C35=\"\",\"\",IF(C35=活用係数の設定!$E$13,活用係数の設定!$H$24*E35,\"\")))","v":""},{"$f":"IF(取組対象の選択!$D$13=\"\",\"\",IF(C35=\"\",\"\",IF(C35=活用係数の設定!$E$30,活用係数の設定!$H$41*E35,\"\")))","v":""},{"$f":"IF(取組対象の選択!$D$14=\"\",\"\",IF(C35=\"\",\"\",IF(C35=活用係数の設定!$E$47,活用係数の設定!$H$58*E35,\"\")))","v":""},{"$f":"IF(社員一覧の作成!D35=\"\",\"\",社員一覧の作成!D35)","v":""}]
[null,{"$f":"IF(社員一覧の作成!B36=\"\",\"\",社員一覧の作成!B36)","v":""},{"$f":"IF(社員一覧の作成!C36=\"\",\"\",社員一覧の作成!C36)","v":""},"",null,{"$f":"IF(取組対象の選択!$D$12=\"\",\"\",IF(C36=\"\",\"\",IF(C36=活用係数の設定!$E$13,活用係数の設定!$H$24*E36,\"\")))","v":""},{"$f":"IF(取組対象の選択!$D$13=\"\",\"\",IF(C36=\"\",\"\",IF(C36=活用係数の設定!$E$30,活用係数の設定!$H$41*E36,\"\")))","v":""},{"$f":"IF(取組対象の選択!$D$14=\"\",\"\",IF(C36=\"\",\"\",IF(C36=活用係数の設定!$E$47,活用係数の設定!$H$58*E36,\"\")))","v":""},{"$f":"IF(社員一覧の作成!D36=\"\",\"\",社員一覧の作成!D36)","v":""}]
[null,{"$f":"IF(社員一覧の作成!B37=\"\",\"\",社員一覧の作成!B37)","v":""},{"$f":"IF(社員一覧の作成!C37=\"\",\"\",社員一覧の作成!C37)","v":""},"",null,{"$f":"IF(取組対象の選択!$D$12=\"\",\"\",IF(C37=\"\",\"\",IF(C37=活用係数の設定!$E$13,活用係数の設定!$H$24*E37,\"\")))","v":""},{"$f":"IF(取組対象の選択!$D$13=\"\",\"\",IF(C37=\"\",\"\",IF(C37=活用係数の設定!$E$30,活用係数の設定!$H$41*E37,\"\")))","v":""},{"$f":"IF(取組対象の選択!$D$14=\"\",\"\",IF(C37=\"\",\"\",IF(C37=活用係数の設定!$E$47,活用係数の設定!$H$58*E37,\"\")))","v":""},{"$f":"IF(社員一覧の作成!D37=\"\",\"\",社員一覧の作成!D37)","v":""}]
[null,{"$f":"IF(社員一覧の作成!B38=\"\",\"\",社員一覧の作成!B38)","v":""},{"$f":"IF(社員一覧の作成!C38=\"\",\"\",社員一覧の作成!C38)","v":""},"",null,{"$f":"IF(取組対象の選択!$D$12=\"\",\"\",IF(C38=\"\",\"\",IF(C38=活用係数の設定!$E$13,活用係数の設定!$H$24*E38,\"\")))","v":""},{"$f":"IF(取組対象の選択!$D$13=\"\",\"\",IF(C38=\"\",\"\",IF(C38=活用係数の設定!$E$30,活用係数の設定!$H$41*E38,\"\")))","v":""},{"$f":"IF(取組対象の選択!$D$14=\"\",\"\",IF(C38=\"\",\"\",IF(C38=活用係数の設定!$E$47,活用係数の設定!$H$58*E38,\"\")))","v":""},{"$f":"IF(社員一覧の作成!D38=\"\",\"\",社員一覧の作成!D38)","v":""}]
[null,{"$f":"IF(社員一覧の作成!B39=\"\",\"\",社員一覧の作成!B39)","v":""},{"$f":"IF(社員一覧の作成!C39=\"\",\"\",社員一覧の作成!C39)","v":""},"",null,{"$f":"IF(取組対象の選択!$D$12=\"\",\"\",IF(C39=\"\",\"\",IF(C39=活用係数の設定!$E$13,活用係数の設定!$H$24*E39,\"\")))","v":""},{"$f":"IF(取組対象の選択!$D$13=\"\",\"\",IF(C39=\"\",\"\",IF(C39=活用係数の設定!$E$30,活用係数の設定!$H$41*E39,\"\")))","v":""},{"$f":"IF(取組対象の選択!$D$14=\"\",\"\",IF(C39=\"\",\"\",IF(C39=活用係数の設定!$E$47,活用係数の設定!$H$58*E39,\"\")))","v":""},{"$f":"IF(社員一覧の作成!D39=\"\",\"\",社員一覧の作成!D39)","v":""}]
[null,{"$f":"IF(社員一覧の作成!B40=\"\",\"\",社員一覧の作成!B40)","v":""},{"$f":"IF(社員一覧の作成!C40=\"\",\"\",社員一覧の作成!C40)","v":""},"",null,{"$f":"IF(取組対象の選択!$D$12=\"\",\"\",IF(C40=\"\",\"\",IF(C40=活用係数の設定!$E$13,活用係数の設定!$H$24*E40,\"\")))","v":""},{"$f":"IF(取組対象の選択!$D$13=\"\",\"\",IF(C40=\"\",\"\",IF(C40=活用係数の設定!$E$30,活用係数の設定!$H$41*E40,\"\")))","v":""},{"$f":"IF(取組対象の選択!$D$14=\"\",\"\",IF(C40=\"\",\"\",IF(C40=活用係数の設定!$E$47,活用係数の設定!$H$58*E40,\"\")))","v":""},{"$f":"IF(社員一覧の作成!D40=\"\",\"\",社員一覧の作成!D40)","v":""}]
[null,{"$f":"IF(社員一覧の作成!B41=\"\",\"\",社員一覧の作成!B41)","v":""},{"$f":"IF(社員一覧の作成!C41=\"\",\"\",社員一覧の作成!C41)","v":""},"",null,{"$f":"IF(取組対象の選択!$D$12=\"\",\"\",IF(C41=\"\",\"\",IF(C41=活用係数の設定!$E$13,活用係数の設定!$H$24*E41,\"\")))","v":""},{"$f":"IF(取組対象の選択!$D$13=\"\",\"\",IF(C41=\"\",\"\",IF(C41=活用係数の設定!$E$30,活用係数の設定!$H$41*E41,\"\")))","v":""},{"$f":"IF(取組対象の選択!$D$14=\"\",\"\",IF(C41=\"\",\"\",IF(C41=活用係数の設定!$E$47,活用係数の設定!$H$58*E41,\"\")))","v":""},{"$f":"IF(社員一覧の作成!D41=\"\",\"\",社員一覧の作成!D41)","v":""}]
[null,{"$f":"IF(社員一覧の作成!B42=\"\",\"\",社員一覧の作成!B42)","v":""},{"$f":"IF(社員一覧の作成!C42=\"\",\"\",社員一覧の作成!C42)","v":""},"",null,{"$f":"IF(取組対象の選択!$D$12=\"\",\"\",IF(C42=\"\",\"\",IF(C42=活用係数の設定!$E$13,活用係数の設定!$H$24*E42,\"\")))","v":""},{"$f":"IF(取組対象の選択!$D$13=\"\",\"\",IF(C42=\"\",\"\",IF(C42=活用係数の設定!$E$30,活用係数の設定!$H$41*E42,\"\")))","v":""},{"$f":"IF(取組対象の選択!$D$14=\"\",\"\",IF(C42=\"\",\"\",IF(C42=活用係数の設定!$E$47,活用係数の設定!$H$58*E42,\"\")))","v":""},{"$f":"IF(社員一覧の作成!D42=\"\",\"\",社員一覧の作成!D42)","v":""}]
[null,{"$f":"IF(社員一覧の作成!B43=\"\",\"\",社員一覧の作成!B43)","v":""},{"$f":"IF(社員一覧の作成!C43=\"\",\"\",社員一覧の作成!C43)","v":""},"",null,{"$f":"IF(取組対象の選択!$D$12=\"\",\"\",IF(C43=\"\",\"\",IF(C43=活用係数の設定!$E$13,活用係数の設定!$H$24*E43,\"\")))","v":""},{"$f":"IF(取組対象の選択!$D$13=\"\",\"\",IF(C43=\"\",\"\",IF(C43=活用係数の設定!$E$30,活用係数の設定!$H$41*E43,\"\")))","v":""},{"$f":"IF(取組対象の選択!$D$14=\"\",\"\",IF(C43=\"\",\"\",IF(C43=活用係数の設定!$E$47,活用係数の設定!$H$58*E43,\"\")))","v":""},{"$f":"IF(社員一覧の作成!D43=\"\",\"\",社員一覧の作成!D43)","v":""}]
[null,{"$f":"IF(社員一覧の作成!B44=\"\",\"\",社員一覧の作成!B44)","v":""},{"$f":"IF(社員一覧の作成!C44=\"\",\"\",社員一覧の作成!C44)","v":""},"",null,{"$f":"IF(取組対象の選択!$D$12=\"\",\"\",IF(C44=\"\",\"\",IF(C44=活用係数の設定!$E$13,活用係数の設定!$H$24*E44,\"\")))","v":""},{"$f":"IF(取組対象の選択!$D$13=\"\",\"\",IF(C44=\"\",\"\",IF(C44=活用係数の設定!$E$30,活用係数の設定!$H$41*E44,\"\")))","v":""},{"$f":"IF(取組対象の選択!$D$14=\"\",\"\",IF(C44=\"\",\"\",IF(C44=活用係数の設定!$E$47,活用係数の設定!$H$58*E44,\"\")))","v":""},{"$f":"IF(社員一覧の作成!D44=\"\",\"\",社員一覧の作成!D44)","v":""}]
[null,{"$f":"IF(社員一覧の作成!B45=\"\",\"\",社員一覧の作成!B45)","v":""},{"$f":"IF(社員一覧の作成!C45=\"\",\"\",社員一覧の作成!C45)","v":""},"",null,{"$f":"IF(取組対象の選択!$D$12=\"\",\"\",IF(C45=\"\",\"\",IF(C45=活用係数の設定!$E$13,活用係数の設定!$H$24*E45,\"\")))","v":""},{"$f":"IF(取組対象の選択!$D$13=\"\",\"\",IF(C45=\"\",\"\",IF(C45=活用係数の設定!$E$30,活用係数の設定!$H$41*E45,\"\")))","v":""},{"$f":"IF(取組対象の選択!$D$14=\"\",\"\",IF(C45=\"\",\"\",IF(C45=活用係数の設定!$E$47,活用係数の設定!$H$58*E45,\"\")))","v":""},{"$f":"IF(社員一覧の作成!D45=\"\",\"\",社員一覧の作成!D45)","v":""}]
[null,{"$f":"IF(社員一覧の作成!B46=\"\",\"\",社員一覧の作成!B46)","v":""},{"$f":"IF(社員一覧の作成!C46=\"\",\"\",社員一覧の作成!C46)","v":""},"",null,{"$f":"IF(取組対象の選択!$D$12=\"\",\"\",IF(C46=\"\",\"\",IF(C46=活用係数の設定!$E$13,活用係数の設定!$H$24*E46,\"\")))","v":""},{"$f":"IF(取組対象の選択!$D$13=\"\",\"\",IF(C46=\"\",\"\",IF(C46=活用係数の設定!$E$30,活用係数の設定!$H$41*E46,\"\")))","v":""},{"$f":"IF(取組対象の選択!$D$14=\"\",\"\",IF(C46=\"\",\"\",IF(C46=活用係数の設定!$E$47,活用係数の設定!$H$58*E46,\"\")))","v":""},{"$f":"IF(社員一覧の作成!D46=\"\",\"\",社員一覧の作成!D46)","v":""}]
[null,{"$f":"IF(社員一覧の作成!B47=\"\",\"\",社員一覧の作成!B47)","v":""},{"$f":"IF(社員一覧の作成!C47=\"\",\"\",社員一覧の作成!C47)","v":""},"",null,{"$f":"IF(取組対象の選択!$D$12=\"\",\"\",IF(C47=\"\",\"\",IF(C47=活用係数の設定!$E$13,活用係数の設定!$H$24*E47,\"\")))","v":""},{"$f":"IF(取組対象の選択!$D$13=\"\",\"\",IF(C47=\"\",\"\",IF(C47=活用係数の設定!$E$30,活用係数の設定!$H$41*E47,\"\")))","v":""},{"$f":"IF(取組対象の選択!$D$14=\"\",\"\",IF(C47=\"\",\"\",IF(C47=活用係数の設定!$E$47,活用係数の設定!$H$58*E47,\"\")))","v":""},{"$f":"IF(社員一覧の作成!D47=\"\",\"\",社員一覧の作成!D47)","v":""}]
[null,{"$f":"IF(社員一覧の作成!B48=\"\",\"\",社員一覧の作成!B48)","v":""},{"$f":"IF(社員一覧の作成!C48=\"\",\"\",社員一覧の作成!C48)","v":""},"",null,{"$f":"IF(取組対象の選択!$D$12=\"\",\"\",IF(C48=\"\",\"\",IF(C48=活用係数の設定!$E$13,活用係数の設定!$H$24*E48,\"\")))","v":""},{"$f":"IF(取組対象の選択!$D$13=\"\",\"\",IF(C48=\"\",\"\",IF(C48=活用係数の設定!$E$30,活用係数の設定!$H$41*E48,\"\")))","v":""},{"$f":"IF(取組対象の選択!$D$14=\"\",\"\",IF(C48=\"\",\"\",IF(C48=活用係数の設定!$E$47,活用係数の設定!$H$58*E48,\"\")))","v":""},{"$f":"IF(社員一覧の作成!D48=\"\",\"\",社員一覧の作成!D48)","v":""}]
[null,{"$f":"IF(社員一覧の作成!B49=\"\",\"\",社員一覧の作成!B49)","v":""},{"$f":"IF(社員一覧の作成!C49=\"\",\"\",社員一覧の作成!C49)","v":""},"",null,{"$f":"IF(取組対象の選択!$D$12=\"\",\"\",IF(C49=\"\",\"\",IF(C49=活用係数の設定!$E$13,活用係数の設定!$H$24*E49,\"\")))","v":""},{"$f":"IF(取組対象の選択!$D$13=\"\",\"\",IF(C49=\"\",\"\",IF(C49=活用係数の設定!$E$30,活用係数の設定!$H$41*E49,\"\")))","v":""},{"$f":"IF(取組対象の選択!$D$14=\"\",\"\",IF(C49=\"\",\"\",IF(C49=活用係数の設定!$E$47,活用係数の設定!$H$58*E49,\"\")))","v":""},{"$f":"IF(社員一覧の作成!D49=\"\",\"\",社員一覧の作成!D49)","v":""}]
[null,{"$f":"IF(社員一覧の作成!B50=\"\",\"\",社員一覧の作成!B50)","v":""},{"$f":"IF(社員一覧の作成!C50=\"\",\"\",社員一覧の作成!C50)","v":""},"",null,{"$f":"IF(取組対象の選択!$D$12=\"\",\"\",IF(C50=\"\",\"\",IF(C50=活用係数の設定!$E$13,活用係数の設定!$H$24*E50,\"\")))","v":""},{"$f":"IF(取組対象の選択!$D$13=\"\",\"\",IF(C50=\"\",\"\",IF(C50=活用係数の設定!$E$30,活用係数の設定!$H$41*E50,\"\")))","v":""},{"$f":"IF(取組対象の選択!$D$14=\"\",\"\",IF(C50=\"\",\"\",IF(C50=活用係数の設定!$E$47,活用係数の設定!$H$58*E50,\"\")))","v":""},{"$f":"IF(社員一覧の作成!D50=\"\",\"\",社員一覧の作成!D50)","v":""}]
[null,{"$f":"IF(社員一覧の作成!B51=\"\",\"\",社員一覧の作成!B51)","v":""},{"$f":"IF(社員一覧の作成!C51=\"\",\"\",社員一覧の作成!C51)","v":""},"",null,{"$f":"IF(取組対象の選択!$D$12=\"\",\"\",IF(C51=\"\",\"\",IF(C51=活用係数の設定!$E$13,活用係数の設定!$H$24*E51,\"\")))","v":""},{"$f":"IF(取組対象の選択!$D$13=\"\",\"\",IF(C51=\"\",\"\",IF(C51=活用係数の設定!$E$30,活用係数の設定!$H$41*E51,\"\")))","v":""},{"$f":"IF(取組対象の選択!$D$14=\"\",\"\",IF(C51=\"\",\"\",IF(C51=活用係数の設定!$E$47,活用係数の設定!$H$58*E51,\"\")))","v":""},{"$f":"IF(社員一覧の作成!D51=\"\",\"\",社員一覧の作成!D51)","v":""}]
[null,{"$f":"IF(社員一覧の作成!B52=\"\",\"\",社員一覧の作成!B52)","v":""},{"$f":"IF(社員一覧の作成!C52=\"\",\"\",社員一覧の作成!C52)","v":""},"",null,{"$f":"IF(取組対象の選択!$D$12=\"\",\"\",IF(C52=\"\",\"\",IF(C52=活用係数の設定!$E$13,活用係数の設定!$H$24*E52,\"\")))","v":""},{"$f":"IF(取組対象の選択!$D$13=\"\",\"\",IF(C52=\"\",\"\",IF(C52=活用係数の設定!$E$30,活用係数の設定!$H$41*E52,\"\")))","v":""},{"$f":"IF(取組対象の選択!$D$14=\"\",\"\",IF(C52=\"\",\"\",IF(C52=活用係数の設定!$E$47,活用係数の設定!$H$58*E52,\"\")))","v":""},{"$f":"IF(社員一覧の作成!D52=\"\",\"\",社員一覧の作成!D52)","v":""}]
[null,{"$f":"IF(社員一覧の作成!B53=\"\",\"\",社員一覧の作成!B53)","v":""},{"$f":"IF(社員一覧の作成!C53=\"\",\"\",社員一覧の作成!C53)","v":""},"",null,{"$f":"IF(取組対象の選択!$D$12=\"\",\"\",IF(C53=\"\",\"\",IF(C53=活用係数の設定!$E$13,活用係数の設定!$H$24*E53,\"\")))","v":""},{"$f":"IF(取組対象の選択!$D$13=\"\",\"\",IF(C53=\"\",\"\",IF(C53=活用係数の設定!$E$30,活用係数の設定!$H$41*E53,\"\")))","v":""},{"$f":"IF(取組対象の選択!$D$14=\"\",\"\",IF(C53=\"\",\"\",IF(C53=活用係数の設定!$E$47,活用係数の設定!$H$58*E53,\"\")))","v":""},{"$f":"IF(社員一覧の作成!D53=\"\",\"\",社員一覧の作成!D53)","v":""}]
[null,{"$f":"IF(社員一覧の作成!B54=\"\",\"\",社員一覧の作成!B54)","v":""},{"$f":"IF(社員一覧の作成!C54=\"\",\"\",社員一覧の作成!C54)","v":""},"",null,{"$f":"IF(取組対象の選択!$D$12=\"\",\"\",IF(C54=\"\",\"\",IF(C54=活用係数の設定!$E$13,活用係数の設定!$H$24*E54,\"\")))","v":""},{"$f":"IF(取組対象の選択!$D$13=\"\",\"\",IF(C54=\"\",\"\",IF(C54=活用係数の設定!$E$30,活用係数の設定!$H$41*E54,\"\")))","v":""},{"$f":"IF(取組対象の選択!$D$14=\"\",\"\",IF(C54=\"\",\"\",IF(C54=活用係数の設定!$E$47,活用係数の設定!$H$58*E54,\"\")))","v":""},{"$f":"IF(社員一覧の作成!D54=\"\",\"\",社員一覧の作成!D54)","v":""}]
[null,{"$f":"IF(社員一覧の作成!B55=\"\",\"\",社員一覧の作成!B55)","v":""},{"$f":"IF(社員一覧の作成!C55=\"\",\"\",社員一覧の作成!C55)","v":""},"",null,{"$f":"IF(取組対象の選択!$D$12=\"\",\"\",IF(C55=\"\",\"\",IF(C55=活用係数の設定!$E$13,活用係数の設定!$H$24*E55,\"\")))","v":""},{"$f":"IF(取組対象の選択!$D$13=\"\",\"\",IF(C55=\"\",\"\",IF(C55=活用係数の設定!$E$30,活用係数の設定!$H$41*E55,\"\")))","v":""},{"$f":"IF(取組対象の選択!$D$14=\"\",\"\",IF(C55=\"\",\"\",IF(C55=活用係数の設定!$E$47,活用係数の設定!$H$58*E55,\"\")))","v":""},{"$f":"IF(社員一覧の作成!D55=\"\",\"\",社員一覧の作成!D55)","v":""}]
[null,{"$f":"IF(社員一覧の作成!B56=\"\",\"\",社員一覧の作成!B56)","v":""},{"$f":"IF(社員一覧の作成!C56=\"\",\"\",社員一覧の作成!C56)","v":""},"",null,{"$f":"IF(取組対象の選択!$D$12=\"\",\"\",IF(C56=\"\",\"\",IF(C56=活用係数の設定!$E$13,活用係数の設定!$H$24*E56,\"\")))","v":""},{"$f":"IF(取組対象の選択!$D$13=\"\",\"\",IF(C56=\"\",\"\",IF(C56=活用係数の設定!$E$30,活用係数の設定!$H$41*E56,\"\")))","v":""},{"$f":"IF(取組対象の選択!$D$14=\"\",\"\",IF(C56=\"\",\"\",IF(C56=活用係数の設定!$E$47,活用係数の設定!$H$58*E56,\"\")))","v":""},{"$f":"IF(社員一覧の作成!D56=\"\",\"\",社員一覧の作成!D56)","v":""}]
[null,{"$f":"IF(社員一覧の作成!B57=\"\",\"\",社員一覧の作成!B57)","v":""},{"$f":"IF(社員一覧の作成!C57=\"\",\"\",社員一覧の作成!C57)","v":""},"",null,{"$f":"IF(取組対象の選択!$D$12=\"\",\"\",IF(C57=\"\",\"\",IF(C57=活用係数の設定!$E$13,活用係数の設定!$H$24*E57,\"\")))","v":""},{"$f":"IF(取組対象の選択!$D$13=\"\",\"\",IF(C57=\"\",\"\",IF(C57=活用係数の設定!$E$30,活用係数の設定!$H$41*E57,\"\")))","v":""},{"$f":"IF(取組対象の選択!$D$14=\"\",\"\",IF(C57=\"\",\"\",IF(C57=活用係数の設定!$E$47,活用係数の設定!$H$58*E57,\"\")))","v":""},{"$f":"IF(社員一覧の作成!D57=\"\",\"\",社員一覧の作成!D57)","v":""}]
[null,{"$f":"IF(社員一覧の作成!B58=\"\",\"\",社員一覧の作成!B58)","v":""},{"$f":"IF(社員一覧の作成!C58=\"\",\"\",社員一覧の作成!C58)","v":""},"",null,{"$f":"IF(取組対象の選択!$D$12=\"\",\"\",IF(C58=\"\",\"\",IF(C58=活用係数の設定!$E$13,活用係数の設定!$H$24*E58,\"\")))","v":""},{"$f":"IF(取組対象の選択!$D$13=\"\",\"\",IF(C58=\"\",\"\",IF(C58=活用係数の設定!$E$30,活用係数の設定!$H$41*E58,\"\")))","v":""},{"$f":"IF(取組対象の選択!$D$14=\"\",\"\",IF(C58=\"\",\"\",IF(C58=活用係数の設定!$E$47,活用係数の設定!$H$58*E58,\"\")))","v":""},{"$f":"IF(社員一覧の作成!D58=\"\",\"\",社員一覧の作成!D58)","v":""}]
[null,{"$f":"IF(社員一覧の作成!B59=\"\",\"\",社員一覧の作成!B59)","v":""},{"$f":"IF(社員一覧の作成!C59=\"\",\"\",社員一覧の作成!C59)","v":""},"",null,{"$f":"IF(取組対象の選択!$D$12=\"\",\"\",IF(C59=\"\",\"\",IF(C59=活用係数の設定!$E$13,活用係数の設定!$H$24*E59,\"\")))","v":""},{"$f":"IF(取組対象の選択!$D$13=\"\",\"\",IF(C59=\"\",\"\",IF(C59=活用係数の設定!$E$30,活用係数の設定!$H$41*E59,\"\")))","v":""},{"$f":"IF(取組対象の選択!$D$14=\"\",\"\",IF(C59=\"\",\"\",IF(C59=活用係数の設定!$E$47,活用係数の設定!$H$58*E59,\"\")))","v":""},{"$f":"IF(社員一覧の作成!D59=\"\",\"\",社員一覧の作成!D59)","v":""}]
[null,{"$f":"IF(社員一覧の作成!B60=\"\",\"\",社員一覧の作成!B60)","v":""},{"$f":"IF(社員一覧の作成!C60=\"\",\"\",社員一覧の作成!C60)","v":""},"",null,{"$f":"IF(取組対象の選択!$D$12=\"\",\"\",IF(C60=\"\",\"\",IF(C60=活用係数の設定!$E$13,活用係数の設定!$H$24*E60,\"\")))","v":""},{"$f":"IF(取組対象の選択!$D$13=\"\",\"\",IF(C60=\"\",\"\",IF(C60=活用係数の設定!$E$30,活用係数の設定!$H$41*E60,\"\")))","v":""},{"$f":"IF(取組対象の選択!$D$14=\"\",\"\",IF(C60=\"\",\"\",IF(C60=活用係数の設定!$E$47,活用係数の設定!$H$58*E60,\"\")))","v":""},{"$f":"IF(社員一覧の作成!D60=\"\",\"\",社員一覧の作成!D60)","v":""}]
[null,{"$f":"IF(社員一覧の作成!B61=\"\",\"\",社員一覧の作成!B61)","v":""},{"$f":"IF(社員一覧の作成!C61=\"\",\"\",社員一覧の作成!C61)","v":""},"",null,{"$f":"IF(取組対象の選択!$D$12=\"\",\"\",IF(C61=\"\",\"\",IF(C61=活用係数の設定!$E$13,活用係数の設定!$H$24*E61,\"\")))","v":""},{"$f":"IF(取組対象の選択!$D$13=\"\",\"\",IF(C61=\"\",\"\",IF(C61=活用係数の設定!$E$30,活用係数の設定!$H$41*E61,\"\")))","v":""},{"$f":"IF(取組対象の選択!$D$14=\"\",\"\",IF(C61=\"\",\"\",IF(C61=活用係数の設定!$E$47,活用係数の設定!$H$58*E61,\"\")))","v":""},{"$f":"IF(社員一覧の作成!D61=\"\",\"\",社員一覧の作成!D61)","v":""}]
[null,{"$f":"IF(社員一覧の作成!B62=\"\",\"\",社員一覧の作成!B62)","v":""},{"$f":"IF(社員一覧の作成!C62=\"\",\"\",社員一覧の作成!C62)","v":""},"",null,{"$f":"IF(取組対象の選択!$D$12=\"\",\"\",IF(C62=\"\",\"\",IF(C62=活用係数の設定!$E$13,活用係数の設定!$H$24*E62,\"\")))","v":""},{"$f":"IF(取組対象の選択!$D$13=\"\",\"\",IF(C62=\"\",\"\",IF(C62=活用係数の設定!$E$30,活用係数の設定!$H$41*E62,\"\")))","v":""},{"$f":"IF(取組対象の選択!$D$14=\"\",\"\",IF(C62=\"\",\"\",IF(C62=活用係数の設定!$E$47,活用係数の設定!$H$58*E62,\"\")))","v":""},{"$f":"IF(社員一覧の作成!D62=\"\",\"\",社員一覧の作成!D62)","v":""}]
[null,null,null,""]
[]
[null,null,null,{"$f":"MAX(D13:D62)","v":15},{"$f":"MAX(E13:E62)","v":1600}]

{"sheet":"均等・均衡待遇のチェック","index":8,"n_rows":99,"n_cols":31,"rows_kept":99,"cut":false,"hidden":false,"merged":[[13,5,13,6],[11,8,11,9],[13,8,13,9],[11,2,11,3],[13,2,13,3],[11,5,11,6]]}
[]
[]
[]
[]
[]
[]
[]
[]
["均等・均衡待遇のチェック"]
[null,"プロット図①",null,null,"プロット図②",null,null,"プロット図③"]
[null,"　取組対象とするパート・有期：",null,null,"　取組対象とするパート・有期：",null,null,"　取組対象とするパート・有期："]
[null,null,{"$f":"IF(取組対象の選択!D12=0,\"\",取組対象の選択!D12)","v":"パート１"},null,null,{"$f":"IF(取組対象の選択!D13=0,\"\",取組対象の選択!D13)","v":"サポート"},null,null,{"$f":"IF(取組対象の選択!D14=0,\"\",取組対象の選択!D14)","v":""}]
[null,"　比較対象とする正社員：",null,null,"　比較対象とする正社員：",null,null,"　比較対象とする正社員："]
[null,null,{"$f":"IF(取組対象の選択!I12=0,\"\",取組対象の選択!I12)","v":"総合職"},null,null,{"$f":"IF(取組対象の選択!I13=0,\"\",取組対象の選択!I13)","v":"総合職"},null,null,{"$f":"IF(取組対象の選択!I14=0,\"\",取組対象の選択!I14)","v":""}]
[null,null,null,""]
[null,null,null,""]
[null,null,"プロット図①",null,null,{"$f":"C12&\"と\"&C14&\"の比較\"","v":"パート１と総合職の比較"},null,null,null,null,null,null,"プロット図②",null,null,{"$f":"F12&\"と\"&F14&\"の比較\"","v":"サポートと総合職の比較"},null,null,null,null,null,null,null,null,"プロット図③",null,null,{"$f":"I12&\"と\"&I14&\"の比較\"","v":"との比較"}]
[null,null,null,""]
[null,null,null,""]
[null,null,null,""]
[null,null,null,""]
[null,null,null,""]
[null,null,null,""]
[null,null,null,""]
[null,null,null,""]
[null,null,null,""]
[null,null,null,""]
[null,null,null,""]
[null,null,null,""]
[null,null,null,""]
[null,null,null,""]
[null,null,null,""]
[null,null,null,""]
[null,null,null,""]
[null,null,null,""]
[null,null,null,""]
[null,null,null,""]
[null,null,null,""]
[null,null,null,""]
[null,null,null,""]
[null,null,null,""]
[null,null,null,""]
[null,null,null,""]
[null,null,null,""]
[null,null,null,""]
[null,null,null,""]
[null,null,null,"",null,"正社員",null,null,"非正規社員",null,null,null,null,null,"正社員",null,null,"非正規社員",null,null,null,null,null,null,null,null,"正社員",null,null,"非正規社員"]
[null,null,null,"",null,{"$f":"C14","v":"総合職"},{"$f":"活用係数の設定!H24","v":0.9},null,{"$f":"C12","v":"パート１"},null,null,null,null,null,{"$f":"F14","v":"総合職"},{"$f":"活用係数の設定!H41","v":0.8},null,{"$f":"F12","v":"サポート"},null,null,null,null,null,null,null,null,{"$f":"I14","v":""},{"$f":"活用係数の設定!H58","v":0.7},null,{"$f":"I12","v":""}]
[null,null,null,"",null,"職務ｐｔ","時間賃率",null,"職務ｐｔ","時間賃率",null,null,null,null,"職務ｐｔ","時間賃率",null,"職務ｐｔ","時間賃率",null,null,null,null,null,null,null,"職務ｐｔ","時間賃率",null,"職務ｐｔ","時間賃率"]
[null,null,null,1,null,{"$f":"IF(時間賃率の計算!$C13=均等・均衡待遇のチェック!F$48,時間賃率の計算!D13,NA())","v":{"$error":"#N/A"}},{"$f":"IF(時間賃率の計算!$C13=均等・均衡待遇のチェック!F$48,時間賃率の計算!E13*G$48,NA())","v":{"$error":"#N/A"}},null,{"$f":"IF(時間賃率の計算!$C13=均等・均衡待遇のチェック!I$48,時間賃率の計算!D13,NA())","v":{"$error":"#N/A"}},{"$f":"IF(時間賃率の計算!$C13=均等・均衡待遇のチェック!I$48,時間賃率の計算!E13,NA())","v":{"$error":"#N/A"}},null,null,null,null,{"$f":"IF(時間賃率の計算!$C13=均等・均衡待遇のチェック!O$48,時間賃率の計算!D13,NA())","v":{"$error":"#N/A"}},{"$f":"IF(時間賃率の計算!$C13=均等・均衡待遇のチェック!O$48,時間賃率の計算!E13*P$48,NA())","v":{"$error":"#N/A"}},null,{"$f":"IF(時間賃率の計算!$C13=均等・均衡待遇のチェック!R$48,時間賃率の計算!D13,NA())","v":{"$error":"#N/A"}},{"$f":"IF(時間賃率の計算!$C13=均等・均衡待遇のチェック!R$48,時間賃率の計算!E13,NA())","v":{"$error":"#N/A"}},null,null,null,null,null,null,null,{"$f":"IF(時間賃率の計算!$C13=均等・均衡待遇のチェック!AA$48,時間賃率の計算!D13,NA())","v":{"$error":"#N/A"}},{"$f":"IF(時間賃率の計算!$C13=均等・均衡待遇のチェック!AA$48,時間賃率の計算!E13*AB$48,NA())","v":{"$error":"#N/A"}},null,{"$f":"IF(時間賃率の計算!$C13=均等・均衡待遇のチェック!AD$48,時間賃率の計算!D13,NA())","v":{"$error":"#N/A"}},{"$f":"IF(時間賃率の計算!$C13=均等・均衡待遇のチェック!AD$48,時間賃率の計算!E13,NA())","v":{"$error":"#N/A"}}]
[null,null,null,{"$f":"D50+1","v":2},null,{"$f":"IF(時間賃率の計算!$C14=均等・均衡待遇のチェック!F$48,時間賃率の計算!D14,NA())","v":{"$error":"#N/A"}},{"$f":"IF(時間賃率の計算!$C14=均等・均衡待遇のチェック!F$48,時間賃率の計算!E14*G$48,NA())","v":{"$error":"#N/A"}},null,{"$f":"IF(時間賃率の計算!$C14=均等・均衡待遇のチェック!I$48,時間賃率の計算!D14,NA())","v":{"$error":"#N/A"}},{"$f":"IF(時間賃率の計算!$C14=均等・均衡待遇のチェック!I$48,時間賃率の計算!E14,NA())","v":{"$error":"#N/A"}},null,null,null,null,{"$f":"IF(時間賃率の計算!$C14=均等・均衡待遇のチェック!O$48,時間賃率の計算!D14,NA())","v":{"$error":"#N/A"}},{"$f":"IF(時間賃率の計算!$C14=均等・均衡待遇のチェック!O$48,時間賃率の計算!E14*P$48,NA())","v":{"$error":"#N/A"}},null,{"$f":"IF(時間賃率の計算!$C14=均等・均衡待遇のチェック!R$48,時間賃率の計算!D14,NA())","v":{"$error":"#N/A"}},{"$f":"IF(時間賃率の計算!$C14=均等・均衡待遇のチェック!R$48,時間賃率の計算!E14,NA())","v":{"$error":"#N/A"}},null,null,null,null,null,null,null,{"$f":"IF(時間賃率の計算!$C14=均等・均衡待遇のチェック!AA$48,時間賃率の計算!D14,NA())","v":{"$error":"#N/A"}},{"$f":"IF(時間賃率の計算!$C14=均等・均衡待遇のチェック!AA$48,時間賃率の計算!E14*AB$48,NA())","v":{"$error":"#N/A"}},null,{"$f":"IF(時間賃率の計算!$C14=均等・均衡待遇のチェック!AD$48,時間賃率の計算!D14,NA())","v":{"$error":"#N/A"}},{"$f":"IF(時間賃率の計算!$C14=均等・均衡待遇のチェック!AD$48,時間賃率の計算!E14,NA())","v":{"$error":"#N/A"}}]
[null,null,null,{"$f":"D51+1","v":3},null,{"$f":"IF(時間賃率の計算!$C15=均等・均衡待遇のチェック!F$48,時間賃率の計算!D15,NA())","v":14},{"$f":"IF(時間賃率の計算!$C15=均等・均衡待遇のチェック!F$48,時間賃率の計算!E15*G$48,NA())","v":1170},null,{"$f":"IF(時間賃率の計算!$C15=均等・均衡待遇のチェック!I$48,時間賃率の計算!D15,NA())","v":{"$error":"#N/A"}},{"$f":"IF(時間賃率の計算!$C15=均等・均衡待遇のチェック!I$48,時間賃率の計算!E15,NA())","v":{"$error":"#N/A"}},null,null,null,null,{"$f":"IF(時間賃率の計算!$C15=均等・均衡待遇のチェック!O$48,時間賃率の計算!D15,NA())","v":14},{"$f":"IF(時間賃率の計算!$C15=均等・均衡待遇のチェック!O$48,時間賃率の計算!E15*P$48,NA())","v":1040},null,{"$f":"IF(時間賃率の計算!$C15=均等・均衡待遇のチェック!R$48,時間賃率の計算!D15,NA())","v":{"$error":"#N/A"}},{"$f":"IF(時間賃率の計算!$C15=均等・均衡待遇のチェック!R$48,時間賃率の計算!E15,NA())","v":{"$error":"#N/A"}},null,null,null,null,null,null,null,{"$f":"IF(時間賃率の計算!$C15=均等・均衡待遇のチェック!AA$48,時間賃率の計算!D15,NA())","v":{"$error":"#N/A"}},{"$f":"IF(時間賃率の計算!$C15=均等・均衡待遇のチェック!AA$48,時間賃率の計算!E15*AB$48,NA())","v":{"$error":"#N/A"}},null,{"$f":"IF(時間賃率の計算!$C15=均等・均衡待遇のチェック!AD$48,時間賃率の計算!D15,NA())","v":{"$error":"#N/A"}},{"$f":"IF(時間賃率の計算!$C15=均等・均衡待遇のチェック!AD$48,時間賃率の計算!E15,NA())","v":{"$error":"#N/A"}}]
[null,null,null,4,null,{"$f":"IF(時間賃率の計算!$C16=均等・均衡待遇のチェック!F$48,時間賃率の計算!D16,NA())","v":13},{"$f":"IF(時間賃率の計算!$C16=均等・均衡待遇のチェック!F$48,時間賃率の計算!E16*G$48,NA())","v":1350},null,{"$f":"IF(時間賃率の計算!$C16=均等・均衡待遇のチェック!I$48,時間賃率の計算!D16,NA())","v":{"$error":"#N/A"}},{"$f":"IF(時間賃率の計算!$C16=均等・均衡待遇のチェック!I$48,時間賃率の計算!E16,NA())","v":{"$error":"#N/A"}},null,null,null,null,{"$f":"IF(時間賃率の計算!$C16=均等・均衡待遇のチェック!O$48,時間賃率の計算!D16,NA())","v":13},{"$f":"IF(時間賃率の計算!$C16=均等・均衡待遇のチェック!O$48,時間賃率の計算!E16*P$48,NA())","v":1200},null,{"$f":"IF(時間賃率の計算!$C16=均等・均衡待遇のチェック!R$48,時間賃率の計算!D16,NA())","v":{"$error":"#N/A"}},{"$f":"IF(時間賃率の計算!$C16=均等・均衡待遇のチェック!R$48,時間賃率の計算!E16,NA())","v":{"$error":"#N/A"}},null,null,null,null,null,null,null,{"$f":"IF(時間賃率の計算!$C16=均等・均衡待遇のチェック!AA$48,時間賃率の計算!D16,NA())","v":{"$error":"#N/A"}},{"$f":"IF(時間賃率の計算!$C16=均等・均衡待遇のチェック!AA$48,時間賃率の計算!E16*AB$48,NA())","v":{"$error":"#N/A"}},null,{"$f":"IF(時間賃率の計算!$C16=均等・均衡待遇のチェック!AD$48,時間賃率の計算!D16,NA())","v":{"$error":"#N/A"}},{"$f":"IF(時間賃率の計算!$C16=均等・均衡待遇のチェック!AD$48,時間賃率の計算!E16,NA())","v":{"$error":"#N/A"}}]
[null,null,null,5,null,{"$f":"IF(時間賃率の計算!$C17=均等・均衡待遇のチェック!F$48,時間賃率の計算!D17,NA())","v":14},{"$f":"IF(時間賃率の計算!$C17=均等・均衡待遇のチェック!F$48,時間賃率の計算!E17*G$48,NA())","v":1395},null,{"$f":"IF(時間賃率の計算!$C17=均等・均衡待遇のチェック!I$48,時間賃率の計算!D17,NA())","v":{"$error":"#N/A"}},{"$f":"IF(時間賃率の計算!$C17=均等・均衡待遇のチェック!I$48,時間賃率の計算!E17,NA())","v":{"$error":"#N/A"}},null,null,null,null,{"$f":"IF(時間賃率の計算!$C17=均等・均衡待遇のチェック!O$48,時間賃率の計算!D17,NA())","v":14},{"$f":"IF(時間賃率の計算!$C17=均等・均衡待遇のチェック!O$48,時間賃率の計算!E17*P$48,NA())","v":1240},null,{"$f":"IF(時間賃率の計算!$C17=均等・均衡待遇のチェック!R$48,時間賃率の計算!D17,NA())","v":{"$error":"#N/A"}},{"$f":"IF(時間賃率の計算!$C17=均等・均衡待遇のチェック!R$48,時間賃率の計算!E17,NA())","v":{"$error":"#N/A"}},null,null,null,null,null,null,null,{"$f":"IF(時間賃率の計算!$C17=均等・均衡待遇のチェック!AA$48,時間賃率の計算!D17,NA())","v":{"$error":"#N/A"}},{"$f":"IF(時間賃率の計算!$C17=均等・均衡待遇のチェック!AA$48,時間賃率の計算!E17*AB$48,NA())","v":{"$error":"#N/A"}},null,{"$f":"IF(時間賃率の計算!$C17=均等・均衡待遇のチェック!AD$48,時間賃率の計算!D17,NA())","v":{"$error":"#N/A"}},{"$f":"IF(時間賃率の計算!$C17=均等・均衡待遇のチェック!AD$48,時間賃率の計算!E17,NA())","v":{"$error":"#N/A"}}]
[null,null,null,6,null,{"$f":"IF(時間賃率の計算!$C18=均等・均衡待遇のチェック!F$48,時間賃率の計算!D18,NA())","v":{"$error":"#N/A"}},{"$f":"IF(時間賃率の計算!$C18=均等・均衡待遇のチェック!F$48,時間賃率の計算!E18*G$48,NA())","v":{"$error":"#N/A"}},null,{"$f":"IF(時間賃率の計算!$C18=均等・均衡待遇のチェック!I$48,時間賃率の計算!D18,NA())","v":{"$error":"#N/A"}},{"$f":"IF(時間賃率の計算!$C18=均等・均衡待遇のチェック!I$48,時間賃率の計算!E18,NA())","v":{"$error":"#N/A"}},null,null,null,null,{"$f":"IF(時間賃率の計算!$C18=均等・均衡待遇のチェック!O$48,時間賃率の計算!D18,NA())","v":{"$error":"#N/A"}},{"$f":"IF(時間賃率の計算!$C18=均等・均衡待遇のチェック!O$48,時間賃率の計算!E18*P$48,NA())","v":{"$error":"#N/A"}},null,{"$f":"IF(時間賃率の計算!$C18=均等・均衡待遇のチェック!R$48,時間賃率の計算!D18,NA())","v":8},{"$f":"IF(時間賃率の計算!$C18=均等・均衡待遇のチェック!R$48,時間賃率の計算!E18,NA())","v":900},null,null,null,null,null,null,null,{"$f":"IF(時間賃率の計算!$C18=均等・均衡待遇のチェック!AA$48,時間賃率の計算!D18,NA())","v":{"$error":"#N/A"}},{"$f":"IF(時間賃率の計算!$C18=均等・均衡待遇のチェック!AA$48,時間賃率の計算!E18*AB$48,NA())","v":{"$error":"#N/A"}},null,{"$f":"IF(時間賃率の計算!$C18=均等・均衡待遇のチェック!AD$48,時間賃率の計算!D18,NA())","v":{"$error":"#N/A"}},{"$f":"IF(時間賃率の計算!$C18=均等・均衡待遇のチェック!AD$48,時間賃率の計算!E18,NA())","v":{"$error":"#N/A"}}]
[null,null,null,7,null,{"$f":"IF(時間賃率の計算!$C19=均等・均衡待遇のチェック!F$48,時間賃率の計算!D19,NA())","v":{"$error":"#N/A"}},{"$f":"IF(時間賃率の計算!$C19=均等・均衡待遇のチェック!F$48,時間賃率の計算!E19*G$48,NA())","v":{"$error":"#N/A"}},null,{"$f":"IF(時間賃率の計算!$C19=均等・均衡待遇のチェック!I$48,時間賃率の計算!D19,NA())","v":{"$error":"#N/A"}},{"$f":"IF(時間賃率の計算!$C19=均等・均衡待遇のチェック!I$48,時間賃率の計算!E19,NA())","v":{"$error":"#N/A"}},null,null,null,null,{"$f":"IF(時間賃率の計算!$C19=均等・均衡待遇のチェック!O$48,時間賃率の計算!D19,NA())","v":{"$error":"#N/A"}},{"$f":"IF(時間賃率の計算!$C19=均等・均衡待遇のチェック!O$48,時間賃率の計算!E19*P$48,NA())","v":{"$error":"#N/A"}},null,{"$f":"IF(時間賃率の計算!$C19=均等・均衡待遇のチェック!R$48,時間賃率の計算!D19,NA())","v":11},{"$f":"IF(時間賃率の計算!$C19=均等・均衡待遇のチェック!R$48,時間賃率の計算!E19,NA())","v":1000},null,null,null,null,null,null,null,{"$f":"IF(時間賃率の計算!$C19=均等・均衡待遇のチェック!AA$48,時間賃率の計算!D19,NA())","v":{"$error":"#N/A"}},{"$f":"IF(時間賃率の計算!$C19=均等・均衡待遇のチェック!AA$48,時間賃率の計算!E19*AB$48,NA())","v":{"$error":"#N/A"}},null,{"$f":"IF(時間賃率の計算!$C19=均等・均衡待遇のチェック!AD$48,時間賃率の計算!D19,NA())","v":{"$error":"#N/A"}},{"$f":"IF(時間賃率の計算!$C19=均等・均衡待遇のチェック!AD$48,時間賃率の計算!E19,NA())","v":{"$error":"#N/A"}}]
[null,null,null,8,null,{"$f":"IF(時間賃率の計算!$C20=均等・均衡待遇のチェック!F$48,時間賃率の計算!D20,NA())","v":{"$error":"#N/A"}},{"$f":"IF(時間賃率の計算!$C20=均等・均衡待遇のチェック!F$48,時間賃率の計算!E20*G$48,NA())","v":{"$error":"#N/A"}},null,{"$f":"IF(時間賃率の計算!$C20=均等・均衡待遇のチェック!I$48,時間賃率の計算!D20,NA())","v":{"$error":"#N/A"}},{"$f":"IF(時間賃率の計算!$C20=均等・均衡待遇のチェック!I$48,時間賃率の計算!E20,NA())","v":{"$error":"#N/A"}},null,null,null,null,{"$f":"IF(時間賃率の計算!$C20=均等・均衡待遇のチェック!O$48,時間賃率の計算!D20,NA())","v":{"$error":"#N/A"}},{"$f":"IF(時間賃率の計算!$C20=均等・均衡待遇のチェック!O$48,時間賃率の計算!E20*P$48,NA())","v":{"$error":"#N/A"}},null,{"$f":"IF(時間賃率の計算!$C20=均等・均衡待遇のチェック!R$48,時間賃率の計算!D20,NA())","v":10},{"$f":"IF(時間賃率の計算!$C20=均等・均衡待遇のチェック!R$48,時間賃率の計算!E20,NA())","v":900},null,null,null,null,null,null,null,{"$f":"IF(時間賃率の計算!$C20=均等・均衡待遇のチェック!AA$48,時間賃率の計算!D20,NA())","v":{"$error":"#N/A"}},{"$f":"IF(時間賃率の計算!$C20=均等・均衡待遇のチェック!AA$48,時間賃率の計算!E20*AB$48,NA())","v":{"$error":"#N/A"}},null,{"$f":"IF(時間賃率の計算!$C20=均等・均衡待遇のチェック!AD$48,時間賃率の計算!D20,NA())","v":{"$error":"#N/A"}},{"$f":"IF(時間賃率の計算!$C20=均等・均衡待遇のチェック!AD$48,時間賃率の計算!E20,NA())","v":{"$error":"#N/A"}}]
[null,null,null,9,null,{"$f":"IF(時間賃率の計算!$C21=均等・均衡待遇のチェック!F$48,時間賃率の計算!D21,NA())","v":{"$error":"#N/A"}},{"$f":"IF(時間賃率の計算!$C21=均等・均衡待遇のチェック!F$48,時間賃率の計算!E21*G$48,NA())","v":{"$error":"#N/A"}},null,{"$f":"IF(時間賃率の計算!$C21=均等・均衡待遇のチェック!I$48,時間賃率の計算!D21,NA())","v":{"$error":"#N/A"}},{"$f":"IF(時間賃率の計算!$C21=均等・均衡待遇のチェック!I$48,時間賃率の計算!E21,NA())","v":{"$error":"#N/A"}},null,null,null,null,{"$f":"IF(時間賃率の計算!$C21=均等・均衡待遇のチェック!O$48,時間賃率の計算!D21,NA())","v":{"$error":"#N/A"}},{"$f":"IF(時間賃率の計算!$C21=均等・均衡待遇のチェック!O$48,時間賃率の計算!E21*P$48,NA())","v":{"$error":"#N/A"}},null,{"$f":"IF(時間賃率の計算!$C21=均等・均衡待遇のチェック!R$48,時間賃率の計算!D21,NA())","v":11},{"$f":"IF(時間賃率の計算!$C21=均等・均衡待遇のチェック!R$48,時間賃率の計算!E21,NA())","v":1100},null,null,null,null,null,null,null,{"$f":"IF(時間賃率の計算!$C21=均等・均衡待遇のチェック!AA$48,時間賃率の計算!D21,NA())","v":{"$error":"#N/A"}},{"$f":"IF(時間賃率の計算!$C21=均等・均衡待遇のチェック!AA$48,時間賃率の計算!E21*AB$48,NA())","v":{"$error":"#N/A"}},null,{"$f":"IF(時間賃率の計算!$C21=均等・均衡待遇のチェック!AD$48,時間賃率の計算!D21,NA())","v":{"$error":"#N/A"}},{"$f":"IF(時間賃率の計算!$C21=均等・均衡待遇のチェック!AD$48,時間賃率の計算!E21,NA())","v":{"$error":"#N/A"}}]
[null,null,null,10,null,{"$f":"IF(時間賃率の計算!$C22=均等・均衡待遇のチェック!F$48,時間賃率の計算!D22,NA())","v":{"$error":"#N/A"}},{"$f":"IF(時間賃率の計算!$C22=均等・均衡待遇のチェック!F$48,時間賃率の計算!E22*G$48,NA())","v":{"$error":"#N/A"}},null,{"$f":"IF(時間賃率の計算!$C22=均等・均衡待遇のチェック!I$48,時間賃率の計算!D22,NA())","v":8},{"$f":"IF(時間賃率の計算!$C22=均等・均衡待遇のチェック!I$48,時間賃率の計算!E22,NA())","v":990},null,null,null,null,{"$f":"IF(時間賃率の計算!$C22=均等・均衡待遇のチェック!O$48,時間賃率の計算!D22,NA())","v":{"$error":"#N/A"}},{"$f":"IF(時間賃率の計算!$C22=均等・均衡待遇のチェック!O$48,時間賃率の計算!E22*P$48,NA())","v":{"$error":"#N/A"}},null,{"$f":"IF(時間賃率の計算!$C22=均等・均衡待遇のチェック!R$48,時間賃率の計算!D22,NA())","v":{"$error":"#N/A"}},{"$f":"IF(時間賃率の計算!$C22=均等・均衡待遇のチェック!R$48,時間賃率の計算!E22,NA())","v":{"$error":"#N/A"}},null,null,null,null,null,null,null,{"$f":"IF(時間賃率の計算!$C22=均等・均衡待遇のチェック!AA$48,時間賃率の計算!D22,NA())","v":{"$error":"#N/A"}},{"$f":"IF(時間賃率の計算!$C22=均等・均衡待遇のチェック!AA$48,時間賃率の計算!E22*AB$48,NA())","v":{"$error":"#N/A"}},null,{"$f":"IF(時間賃率の計算!$C22=均等・均衡待遇のチェック!AD$48,時間賃率の計算!D22,NA())","v":{"$error":"#N/A"}},{"$f":"IF(時間賃率の計算!$C22=均等・均衡待遇のチェック!AD$48,時間賃率の計算!E22,NA())","v":{"$error":"#N/A"}}]
[null,null,null,11,null,{"$f":"IF(時間賃率の計算!$C23=均等・均衡待遇のチェック!F$48,時間賃率の計算!D23,NA())","v":{"$error":"#N/A"}},{"$f":"IF(時間賃率の計算!$C23=均等・均衡待遇のチェック!F$48,時間賃率の計算!E23*G$48,NA())","v":{"$error":"#N/A"}},null,{"$f":"IF(時間賃率の計算!$C23=均等・均衡待遇のチェック!I$48,時間賃率の計算!D23,NA())","v":13},{"$f":"IF(時間賃率の計算!$C23=均等・均衡待遇のチェック!I$48,時間賃率の計算!E23,NA())","v":1300},null,null,null,null,{"$f":"IF(時間賃率の計算!$C23=均等・均衡待遇のチェック!O$48,時間賃率の計算!D23,NA())","v":{"$error":"#N/A"}},{"$f":"IF(時間賃率の計算!$C23=均等・均衡待遇のチェック!O$48,時間賃率の計算!E23*P$48,NA())","v":{"$error":"#N/A"}},null,{"$f":"IF(時間賃率の計算!$C23=均等・均衡待遇のチェック!R$48,時間賃率の計算!D23,NA())","v":{"$error":"#N/A"}},{"$f":"IF(時間賃率の計算!$C23=均等・均衡待遇のチェック!R$48,時間賃率の計算!E23,NA())","v":{"$error":"#N/A"}},null,null,null,null,null,null,null,{"$f":"IF(時間賃率の計算!$C23=均等・均衡待遇のチェック!AA$48,時間賃率の計算!D23,NA())","v":{"$error":"#N/A"}},{"$f":"IF(時間賃率の計算!$C23=均等・均衡待遇のチェック!AA$48,時間賃率の計算!E23*AB$48,NA())","v":{"$error":"#N/A"}},null,{"$f":"IF(時間賃率の計算!$C23=均等・均衡待遇のチェック!AD$48,時間賃率の計算!D23,NA())","v":{"$error":"#N/A"}},{"$f":"IF(時間賃率の計算!$C23=均等・均衡待遇のチェック!AD$48,時間賃率の計算!E23,NA())","v":{"$error":"#N/A"}}]
[null,null,null,12,null,{"$f":"IF(時間賃率の計算!$C24=均等・均衡待遇のチェック!F$48,時間賃率の計算!D24,NA())","v":{"$error":"#N/A"}},{"$f":"IF(時間賃率の計算!$C24=均等・均衡待遇のチェック!F$48,時間賃率の計算!E24*G$48,NA())","v":{"$error":"#N/A"}},null,{"$f":"IF(時間賃率の計算!$C24=均等・均衡待遇のチェック!I$48,時間賃率の計算!D24,NA())","v":10},{"$f":"IF(時間賃率の計算!$C24=均等・均衡待遇のチェック!I$48,時間賃率の計算!E24,NA())","v":1050},null,null,null,null,{"$f":"IF(時間賃率の計算!$C24=均等・均衡待遇のチェック!O$48,時間賃率の計算!D24,NA())","v":{"$error":"#N/A"}},{"$f":"IF(時間賃率の計算!$C24=均等・均衡待遇のチェック!O$48,時間賃率の計算!E24*P$48,NA())","v":{"$error":"#N/A"}},null,{"$f":"IF(時間賃率の計算!$C24=均等・均衡待遇のチェック!R$48,時間賃率の計算!D24,NA())","v":{"$error":"#N/A"}},{"$f":"IF(時間賃率の計算!$C24=均等・均衡待遇のチェック!R$48,時間賃率の計算!E24,NA())","v":{"$error":"#N/A"}},null,null,null,null,null,null,null,{"$f":"IF(時間賃率の計算!$C24=均等・均衡待遇のチェック!AA$48,時間賃率の計算!D24,NA())","v":{"$error":"#N/A"}},{"$f":"IF(時間賃率の計算!$C24=均等・均衡待遇のチェック!AA$48,時間賃率の計算!E24*AB$48,NA())","v":{"$error":"#N/A"}},null,{"$f":"IF(時間賃率の計算!$C24=均等・均衡待遇のチェック!AD$48,時間賃率の計算!D24,NA())","v":{"$error":"#N/A"}},{"$f":"IF(時間賃率の計算!$C24=均等・均衡待遇のチェック!AD$48,時間賃率の計算!E24,NA())","v":{"$error":"#N/A"}}]
[null,null,null,13,null,{"$f":"IF(時間賃率の計算!$C25=均等・均衡待遇のチェック!F$48,時間賃率の計算!D25,NA())","v":15},{"$f":"IF(時間賃率の計算!$C25=均等・均衡待遇のチェック!F$48,時間賃率の計算!E25*G$48,NA())","v":1440},null,{"$f":"IF(時間賃率の計算!$C25=均等・均衡待遇のチェック!I$48,時間賃率の計算!D25,NA())","v":{"$error":"#N/A"}},{"$f":"IF(時間賃率の計算!$C25=均等・均衡待遇のチェック!I$48,時間賃率の計算!E25,NA())","v":{"$error":"#N/A"}},null,null,null,null,{"$f":"IF(時間賃率の計算!$C25=均等・均衡待遇のチェック!O$48,時間賃率の計算!D25,NA())","v":15},{"$f":"IF(時間賃率の計算!$C25=均等・均衡待遇のチェック!O$48,時間賃率の計算!E25*P$48,NA())","v":1280},null,{"$f":"IF(時間賃率の計算!$C25=均等・均衡待遇のチェック!R$48,時間賃率の計算!D25,NA())","v":{"$error":"#N/A"}},{"$f":"IF(時間賃率の計算!$C25=均等・均衡待遇のチェック!R$48,時間賃率の計算!E25,NA())","v":{"$error":"#N/A"}},null,null,null,null,null,null,null,{"$f":"IF(時間賃率の計算!$C25=均等・均衡待遇のチェック!AA$48,時間賃率の計算!D25,NA())","v":{"$error":"#N/A"}},{"$f":"IF(時間賃率の計算!$C25=均等・均衡待遇のチェック!AA$48,時間賃率の計算!E25*AB$48,NA())","v":{"$error":"#N/A"}},null,{"$f":"IF(時間賃率の計算!$C25=均等・均衡待遇のチェック!AD$48,時間賃率の計算!D25,NA())","v":{"$error":"#N/A"}},{"$f":"IF(時間賃率の計算!$C25=均等・均衡待遇のチェック!AD$48,時間賃率の計算!E25,NA())","v":{"$error":"#N/A"}}]
[null,null,null,14,null,{"$f":"IF(時間賃率の計算!$C26=均等・均衡待遇のチェック!F$48,時間賃率の計算!D26,NA())","v":{"$error":"#N/A"}},{"$f":"IF(時間賃率の計算!$C26=均等・均衡待遇のチェック!F$48,時間賃率の計算!E26*G$48,NA())","v":{"$error":"#N/A"}},null,{"$f":"IF(時間賃率の計算!$C26=均等・均衡待遇のチェック!I$48,時間賃率の計算!D26,NA())","v":15},{"$f":"IF(時間賃率の計算!$C26=均等・均衡待遇のチェック!I$48,時間賃率の計算!E26,NA())","v":1400},null,null,null,null,{"$f":"IF(時間賃率の計算!$C26=均等・均衡待遇のチェック!O$48,時間賃率の計算!D26,NA())","v":{"$error":"#N/A"}},{"$f":"IF(時間賃率の計算!$C26=均等・均衡待遇のチェック!O$48,時間賃率の計算!E26*P$48,NA())","v":{"$error":"#N/A"}},null,{"$f":"IF(時間賃率の計算!$C26=均等・均衡待遇のチェック!R$48,時間賃率の計算!D26,NA())","v":{"$error":"#N/A"}},{"$f":"IF(時間賃率の計算!$C26=均等・均衡待遇のチェック!R$48,時間賃率の計算!E26,NA())","v":{"$error":"#N/A"}},null,null,null,null,null,null,null,{"$f":"IF(時間賃率の計算!$C26=均等・均衡待遇のチェック!AA$48,時間賃率の計算!D26,NA())","v":{"$error":"#N/A"}},{"$f":"IF(時間賃率の計算!$C26=均等・均衡待遇のチェック!AA$48,時間賃率の計算!E26*AB$48,NA())","v":{"$error":"#N/A"}},null,{"$f":"IF(時間賃率の計算!$C26=均等・均衡待遇のチェック!AD$48,時間賃率の計算!D26,NA())","v":{"$error":"#N/A"}},{"$f":"IF(時間賃率の計算!$C26=均等・均衡待遇のチェック!AD$48,時間賃率の計算!E26,NA())","v":{"$error":"#N/A"}}]
[null,null,null,15,null,{"$f":"IF(時間賃率の計算!$C27=均等・均衡待遇のチェック!F$48,時間賃率の計算!D27,NA())","v":{"$error":"#N/A"}},{"$f":"IF(時間賃率の計算!$C27=均等・均衡待遇のチェック!F$48,時間賃率の計算!E27*G$48,NA())","v":{"$error":"#N/A"}},null,{"$f":"IF(時間賃率の計算!$C27=均等・均衡待遇のチェック!I$48,時間賃率の計算!D27,NA())","v":{"$error":"#N/A"}},{"$f":"IF(時間賃率の計算!$C27=均等・均衡待遇のチェック!I$48,時間賃率の計算!E27,NA())","v":{"$error":"#N/A"}},null,null,null,null,{"$f":"IF(時間賃率の計算!$C27=均等・均衡待遇のチェック!O$48,時間賃率の計算!D27,NA())","v":{"$error":"#N/A"}},{"$f":"IF(時間賃率の計算!$C27=均等・均衡待遇のチェック!O$48,時間賃率の計算!E27*P$48,NA())","v":{"$error":"#N/A"}},null,{"$f":"IF(時間賃率の計算!$C27=均等・均衡待遇のチェック!R$48,時間賃率の計算!D27,NA())","v":{"$error":"#N/A"}},{"$f":"IF(時間賃率の計算!$C27=均等・均衡待遇のチェック!R$48,時間賃率の計算!E27,NA())","v":{"$error":"#N/A"}},null,null,null,null,null,null,null,{"$f":"IF(時間賃率の計算!$C27=均等・均衡待遇のチェック!AA$48,時間賃率の計算!D27,NA())","v":""},{"$f":"IF(時間賃率の計算!$C27=均等・均衡待遇のチェック!AA$48,時間賃率の計算!E27*AB$48,NA())","v":0},null,{"$f":"IF(時間賃率の計算!$C27=均等・均衡待遇のチェック!AD$48,時間賃率の計算!D27,NA())","v":""},{"$f":"IF(時間賃率の計算!$C27=均等・均衡待遇のチェック!AD$48,時間賃率の計算!E27,NA())","v":0}]
[null,null,null,16,null,{"$f":"IF(時間賃率の計算!$C28=均等・均衡待遇のチェック!F$48,時間賃率の計算!D28,NA())","v":{"$error":"#N/A"}},{"$f":"IF(時間賃率の計算!$C28=均等・均衡待遇のチェック!F$48,時間賃率の計算!E28*G$48,NA())","v":{"$error":"#N/A"}},null,{"$f":"IF(時間賃率の計算!$C28=均等・均衡待遇のチェック!I$48,時間賃率の計算!D28,NA())","v":{"$error":"#N/A"}},{"$f":"IF(時間賃率の計算!$C28=均等・均衡待遇のチェック!I$48,時間賃率の計算!E28,NA())","v":{"$error":"#N/A"}},null,null,null,null,{"$f":"IF(時間賃率の計算!$C28=均等・均衡待遇のチェック!O$48,時間賃率の計算!D28,NA())","v":{"$error":"#N/A"}},{"$f":"IF(時間賃率の計算!$C28=均等・均衡待遇のチェック!O$48,時間賃率の計算!E28*P$48,NA())","v":{"$error":"#N/A"}},null,{"$f":"IF(時間賃率の計算!$C28=均等・均衡待遇のチェック!R$48,時間賃率の計算!D28,NA())","v":{"$error":"#N/A"}},{"$f":"IF(時間賃率の計算!$C28=均等・均衡待遇のチェック!R$48,時間賃率の計算!E28,NA())","v":{"$error":"#N/A"}},null,null,null,null,null,null,null,{"$f":"IF(時間賃率の計算!$C28=均等・均衡待遇のチェック!AA$48,時間賃率の計算!D28,NA())","v":""},{"$f":"IF(時間賃率の計算!$C28=均等・均衡待遇のチェック!AA$48,時間賃率の計算!E28*AB$48,NA())","v":0},null,{"$f":"IF(時間賃率の計算!$C28=均等・均衡待遇のチェック!AD$48,時間賃率の計算!D28,NA())","v":""},{"$f":"IF(時間賃率の計算!$C28=均等・均衡待遇のチェック!AD$48,時間賃率の計算!E28,NA())","v":0}]
[null,null,null,17,null,{"$f":"IF(時間賃率の計算!$C29=均等・均衡待遇のチェック!F$48,時間賃率の計算!D29,NA())","v":{"$error":"#N/A"}},{"$f":"IF(時間賃率の計算!$C29=均等・均衡待遇のチェック!F$48,時間賃率の計算!E29*G$48,NA())","v":{"$error":"#N/A"}},null,{"$f":"IF(時間賃率の計算!$C29=均等・均衡待遇のチェック!I$48,時間賃率の計算!D29,NA())","v":{"$error":"#N/A"}},{"$f":"IF(時間賃率の計算!$C29=均等・均衡待遇のチェック!I$48,時間賃率の計算!E29,NA())","v":{"$error":"#N/A"}},null,null,null,null,{"$f":"IF(時間賃率の計算!$C29=均等・均衡待遇のチェック!O$48,時間賃率の計算!D29,NA())","v":{"$error":"#N/A"}},{"$f":"IF(時間賃率の計算!$C29=均等・均衡待遇のチェック!O$48,時間賃率の計算!E29*P$48,NA())","v":{"$error":"#N/A"}},null,{"$f":"IF(時間賃率の計算!$C29=均等・均衡待遇のチェック!R$48,時間賃率の計算!D29,NA())","v":{"$error":"#N/A"}},{"$f":"IF(時間賃率の計算!$C29=均等・均衡待遇のチェック!R$48,時間賃率の計算!E29,NA())","v":{"$error":"#N/A"}},null,null,null,null,null,null,null,{"$f":"IF(時間賃率の計算!$C29=均等・均衡待遇のチェック!AA$48,時間賃率の計算!D29,NA())","v":""},{"$f":"IF(時間賃率の計算!$C29=均等・均衡待遇のチェック!AA$48,時間賃率の計算!E29*AB$48,NA())","v":0},null,{"$f":"IF(時間賃率の計算!$C29=均等・均衡待遇のチェック!AD$48,時間賃率の計算!D29,NA())","v":""},{"$f":"IF(時間賃率の計算!$C29=均等・均衡待遇のチェック!AD$48,時間賃率の計算!E29,NA())","v":0}]
[null,null,null,18,null,{"$f":"IF(時間賃率の計算!$C30=均等・均衡待遇のチェック!F$48,時間賃率の計算!D30,NA())","v":{"$error":"#N/A"}},{"$f":"IF(時間賃率の計算!$C30=均等・均衡待遇のチェック!F$48,時間賃率の計算!E30*G$48,NA())","v":{"$error":"#N/A"}},null,{"$f":"IF(時間賃率の計算!$C30=均等・均衡待遇のチェック!I$48,時間賃率の計算!D30,NA())","v":{"$error":"#N/A"}},{"$f":"IF(時間賃率の計算!$C30=均等・均衡待遇のチェック!I$48,時間賃率の計算!E30,NA())","v":{"$error":"#N/A"}},null,null,null,null,{"$f":"IF(時間賃率の計算!$C30=均等・均衡待遇のチェック!O$48,時間賃率の計算!D30,NA())","v":{"$error":"#N/A"}},{"$f":"IF(時間賃率の計算!$C30=均等・均衡待遇のチェック!O$48,時間賃率の計算!E30*P$48,NA())","v":{"$error":"#N/A"}},null,{"$f":"IF(時間賃率の計算!$C30=均等・均衡待遇のチェック!R$48,時間賃率の計算!D30,NA())","v":{"$error":"#N/A"}},{"$f":"IF(時間賃率の計算!$C30=均等・均衡待遇のチェック!R$48,時間賃率の計算!E30,NA())","v":{"$error":"#N/A"}},null,null,null,null,null,null,null,{"$f":"IF(時間賃率の計算!$C30=均等・均衡待遇のチェック!AA$48,時間賃率の計算!D30,NA())","v":""},{"$f":"IF(時間賃率の計算!$C30=均等・均衡待遇のチェック!AA$48,時間賃率の計算!E30*AB$48,NA())","v":0},null,{"$f":"IF(時間賃率の計算!$C30=均等・均衡待遇のチェック!AD$48,時間賃率の計算!D30,NA())","v":""},{"$f":"IF(時間賃率の計算!$C30=均等・均衡待遇のチェック!AD$48,時間賃率の計算!E30,NA())","v":0}]
[null,null,null,19,null,{"$f":"IF(時間賃率の計算!$C31=均等・均衡待遇のチェック!F$48,時間賃率の計算!D31,NA())","v":{"$error":"#N/A"}},{"$f":"IF(時間賃率の計算!$C31=均等・均衡待遇のチェック!F$48,時間賃率の計算!E31*G$48,NA())","v":{"$error":"#N/A"}},null,{"$f":"IF(時間賃率の計算!$C31=均等・均衡待遇のチェック!I$48,時間賃率の計算!D31,NA())","v":{"$error":"#N/A"}},{"$f":"IF(時間賃率の計算!$C31=均等・均衡待遇のチェック!I$48,時間賃率の計算!E31,NA())","v":{"$error":"#N/A"}},null,null,null,null,{"$f":"IF(時間賃率の計算!$C31=均等・均衡待遇のチェック!O$48,時間賃率の計算!D31,NA())","v":{"$error":"#N/A"}},{"$f":"IF(時間賃率の計算!$C31=均等・均衡待遇のチェック!O$48,時間賃率の計算!E31*P$48,NA())","v":{"$error":"#N/A"}},null,{"$f":"IF(時間賃率の計算!$C31=均等・均衡待遇のチェック!R$48,時間賃率の計算!D31,NA())","v":{"$error":"#N/A"}},{"$f":"IF(時間賃率の計算!$C31=均等・均衡待遇のチェック!R$48,時間賃率の計算!E31,NA())","v":{"$error":"#N/A"}},null,null,null,null,null,null,null,{"$f":"IF(時間賃率の計算!$C31=均等・均衡待遇のチェック!AA$48,時間賃率の計算!D31,NA())","v":""},{"$f":"IF(時間賃率の計算!$C31=均等・均衡待遇のチェック!AA$48,時間賃率の計算!E31*AB$48,NA())","v":0},null,{"$f":"IF(時間賃率の計算!$C31=均等・均衡待遇のチェック!AD$48,時間賃率の計算!D31,NA())","v":""},{"$f":"IF(時間賃率の計算!$C31=均等・均衡待遇のチェック!AD$48,時間賃率の計算!E31,NA())","v":0}]
[null,null,null,20,null,{"$f":"IF(時間賃率の計算!$C32=均等・均衡待遇のチェック!F$48,時間賃率の計算!D32,NA())","v":{"$error":"#N/A"}},{"$f":"IF(時間賃率の計算!$C32=均等・均衡待遇のチェック!F$48,時間賃率の計算!E32*G$48,NA())","v":{"$error":"#N/A"}},null,{"$f":"IF(時間賃率の計算!$C32=均等・均衡待遇のチェック!I$48,時間賃率の計算!D32,NA())","v":{"$error":"#N/A"}},{"$f":"IF(時間賃率の計算!$C32=均等・均衡待遇のチェック!I$48,時間賃率の計算!E32,NA())","v":{"$error":"#N/A"}},null,null,null,null,{"$f":"IF(時間賃率の計算!$C32=均等・均衡待遇のチェック!O$48,時間賃率の計算!D32,NA())","v":{"$error":"#N/A"}},{"$f":"IF(時間賃率の計算!$C32=均等・均衡待遇のチェック!O$48,時間賃率の計算!E32*P$48,NA())","v":{"$error":"#N/A"}},null,{"$f":"IF(時間賃率の計算!$C32=均等・均衡待遇のチェック!R$48,時間賃率の計算!D32,NA())","v":{"$error":"#N/A"}},{"$f":"IF(時間賃率の計算!$C32=均等・均衡待遇のチェック!R$48,時間賃率の計算!E32,NA())","v":{"$error":"#N/A"}},null,null,null,null,null,null,null,{"$f":"IF(時間賃率の計算!$C32=均等・均衡待遇のチェック!AA$48,時間賃率の計算!D32,NA())","v":""},{"$f":"IF(時間賃率の計算!$C32=均等・均衡待遇のチェック!AA$48,時間賃率の計算!E32*AB$48,NA())","v":0},null,{"$f":"IF(時間賃率の計算!$C32=均等・均衡待遇のチェック!AD$48,時間賃率の計算!D32,NA())","v":""},{"$f":"IF(時間賃率の計算!$C32=均等・均衡待遇のチェック!AD$48,時間賃率の計算!E32,NA())","v":0}]
[null,null,null,21,null,{"$f":"IF(時間賃率の計算!$C33=均等・均衡待遇のチェック!F$48,時間賃率の計算!D33,NA())","v":{"$error":"#N/A"}},{"$f":"IF(時間賃率の計算!$C33=均等・均衡待遇のチェック!F$48,時間賃率の計算!E33*G$48,NA())","v":{"$error":"#N/A"}},null,{"$f":"IF(時間賃率の計算!$C33=均等・均衡待遇のチェック!I$48,時間賃率の計算!D33,NA())","v":{"$error":"#N/A"}},{"$f":"IF(時間賃率の計算!$C33=均等・均衡待遇のチェック!I$48,時間賃率の計算!E33,NA())","v":{"$error":"#N/A"}},null,null,null,null,{"$f":"IF(時間賃率の計算!$C33=均等・均衡待遇のチェック!O$48,時間賃率の計算!D33,NA())","v":{"$error":"#N/A"}},{"$f":"IF(時間賃率の計算!$C33=均等・均衡待遇のチェック!O$48,時間賃率の計算!E33*P$48,NA())","v":{"$error":"#N/A"}},null,{"$f":"IF(時間賃率の計算!$C33=均等・均衡待遇のチェック!R$48,時間賃率の計算!D33,NA())","v":{"$error":"#N/A"}},{"$f":"IF(時間賃率の計算!$C33=均等・均衡待遇のチェック!R$48,時間賃率の計算!E33,NA())","v":{"$error":"#N/A"}},null,null,null,null,null,null,null,{"$f":"IF(時間賃率の計算!$C33=均等・均衡待遇のチェック!AA$48,時間賃率の計算!D33,NA())","v":""},{"$f":"IF(時間賃率の計算!$C33=均等・均衡待遇のチェック!AA$48,時間賃率の計算!E33*AB$48,NA())","v":0},null,{"$f":"IF(時間賃率の計算!$C33=均等・均衡待遇のチェック!AD$48,時間賃率の計算!D33,NA())","v":""},{"$f":"IF(時間賃率の計算!$C33=均等・均衡待遇のチェック!AD$48,時間賃率の計算!E33,NA())","v":0}]
[null,null,null,22,null,{"$f":"IF(時間賃率の計算!$C34=均等・均衡待遇のチェック!F$48,時間賃率の計算!D34,NA())","v":{"$error":"#N/A"}},{"$f":"IF(時間賃率の計算!$C34=均等・均衡待遇のチェック!F$48,時間賃率の計算!E34*G$48,NA())","v":{"$error":"#N/A"}},null,{"$f":"IF(時間賃率の計算!$C34=均等・均衡待遇のチェック!I$48,時間賃率の計算!D34,NA())","v":{"$error":"#N/A"}},{"$f":"IF(時間賃率の計算!$C34=均等・均衡待遇のチェック!I$48,時間賃率の計算!E34,NA())","v":{"$error":"#N/A"}},null,null,null,null,{"$f":"IF(時間賃率の計算!$C34=均等・均衡待遇のチェック!O$48,時間賃率の計算!D34,NA())","v":{"$error":"#N/A"}},{"$f":"IF(時間賃率の計算!$C34=均等・均衡待遇のチェック!O$48,時間賃率の計算!E34*P$48,NA())","v":{"$error":"#N/A"}},null,{"$f":"IF(時間賃率の計算!$C34=均等・均衡待遇のチェック!R$48,時間賃率の計算!D34,NA())","v":{"$error":"#N/A"}},{"$f":"IF(時間賃率の計算!$C34=均等・均衡待遇のチェック!R$48,時間賃率の計算!E34,NA())","v":{"$error":"#N/A"}},null,null,null,null,null,null,null,{"$f":"IF(時間賃率の計算!$C34=均等・均衡待遇のチェック!AA$48,時間賃率の計算!D34,NA())","v":""},{"$f":"IF(時間賃率の計算!$C34=均等・均衡待遇のチェック!AA$48,時間賃率の計算!E34*AB$48,NA())","v":0},null,{"$f":"IF(時間賃率の計算!$C34=均等・均衡待遇のチェック!AD$48,時間賃率の計算!D34,NA())","v":""},{"$f":"IF(時間賃率の計算!$C34=均等・均衡待遇のチェック!AD$48,時間賃率の計算!E34,NA())","v":0}]
[null,null,null,23,null,{"$f":"IF(時間賃率の計算!$C35=均等・均衡待遇のチェック!F$48,時間賃率の計算!D35,NA())","v":{"$error":"#N/A"}},{"$f":"IF(時間賃率の計算!$C35=均等・均衡待遇のチェック!F$48,時間賃率の計算!E35*G$48,NA())","v":{"$error":"#N/A"}},null,{"$f":"IF(時間賃率の計算!$C35=均等・均衡待遇のチェック!I$48,時間賃率の計算!D35,NA())","v":{"$error":"#N/A"}},{"$f":"IF(時間賃率の計算!$C35=均等・均衡待遇のチェック!I$48,時間賃率の計算!E35,NA())","v":{"$error":"#N/A"}},null,null,null,null,{"$f":"IF(時間賃率の計算!$C35=均等・均衡待遇のチェック!O$48,時間賃率の計算!D35,NA())","v":{"$error":"#N/A"}},{"$f":"IF(時間賃率の計算!$C35=均等・均衡待遇のチェック!O$48,時間賃率の計算!E35*P$48,NA())","v":{"$error":"#N/A"}},null,{"$f":"IF(時間賃率の計算!$C35=均等・均衡待遇のチェック!R$48,時間賃率の計算!D35,NA())","v":{"$error":"#N/A"}},{"$f":"IF(時間賃率の計算!$C35=均等・均衡待遇のチェック!R$48,時間賃率の計算!E35,NA())","v":{"$error":"#N/A"}},null,null,null,null,null,null,null,{"$f":"IF(時間賃率の計算!$C35=均等・均衡待遇のチェック!AA$48,時間賃率の計算!D35,NA())","v":""},{"$f":"IF(時間賃率の計算!$C35=均等・均衡待遇のチェック!AA$48,時間賃率の計算!E35*AB$48,NA())","v":0},null,{"$f":"IF(時間賃率の計算!$C35=均等・均衡待遇のチェック!AD$48,時間賃率の計算!D35,NA())","v":""},{"$f":"IF(時間賃率の計算!$C35=均等・均衡待遇のチェック!AD$48,時間賃率の計算!E35,NA())","v":0}]
[null,null,null,24,null,{"$f":"IF(時間賃率の計算!$C36=均等・均衡待遇のチェック!F$48,時間賃率の計算!D36,NA())","v":{"$error":"#N/A"}},{"$f":"IF(時間賃率の計算!$C36=均等・均衡待遇のチェック!F$48,時間賃率の計算!E36*G$48,NA())","v":{"$error":"#N/A"}},null,{"$f":"IF(時間賃率の計算!$C36=均等・均衡待遇のチェック!I$48,時間賃率の計算!D36,NA())","v":{"$error":"#N/A"}},{"$f":"IF(時間賃率の計算!$C36=均等・均衡待遇のチェック!I$48,時間賃率の計算!E36,NA())","v":{"$error":"#N/A"}},null,null,null,null,{"$f":"IF(時間賃率の計算!$C36=均等・均衡待遇のチェック!O$48,時間賃率の計算!D36,NA())","v":{"$error":"#N/A"}},{"$f":"IF(時間賃率の計算!$C36=均等・均衡待遇のチェック!O$48,時間賃率の計算!E36*P$48,NA())","v":{"$error":"#N/A"}},null,{"$f":"IF(時間賃率の計算!$C36=均等・均衡待遇のチェック!R$48,時間賃率の計算!D36,NA())","v":{"$error":"#N/A"}},{"$f":"IF(時間賃率の計算!$C36=均等・均衡待遇のチェック!R$48,時間賃率の計算!E36,NA())","v":{"$error":"#N/A"}},null,null,null,null,null,null,null,{"$f":"IF(時間賃率の計算!$C36=均等・均衡待遇のチェック!AA$48,時間賃率の計算!D36,NA())","v":""},{"$f":"IF(時間賃率の計算!$C36=均等・均衡待遇のチェック!AA$48,時間賃率の計算!E36*AB$48,NA())","v":0},null,{"$f":"IF(時間賃率の計算!$C36=均等・均衡待遇のチェック!AD$48,時間賃率の計算!D36,NA())","v":""},{"$f":"IF(時間賃率の計算!$C36=均等・均衡待遇のチェック!AD$48,時間賃率の計算!E36,NA())","v":0}]
[null,null,null,25,null,{"$f":"IF(時間賃率の計算!$C37=均等・均衡待遇のチェック!F$48,時間賃率の計算!D37,NA())","v":{"$error":"#N/A"}},{"$f":"IF(時間賃率の計算!$C37=均等・均衡待遇のチェック!F$48,時間賃率の計算!E37*G$48,NA())","v":{"$error":"#N/A"}},null,{"$f":"IF(時間賃率の計算!$C37=均等・均衡待遇のチェック!I$48,時間賃率の計算!D37,NA())","v":{"$error":"#N/A"}},{"$f":"IF(時間賃率の計算!$C37=均等・均衡待遇のチェック!I$48,時間賃率の計算!E37,NA())","v":{"$error":"#N/A"}},null,null,null,null,{"$f":"IF(時間賃率の計算!$C37=均等・均衡待遇のチェック!O$48,時間賃率の計算!D37,NA())","v":{"$error":"#N/A"}},{"$f":"IF(時間賃率の計算!$C37=均等・均衡待遇のチェック!O$48,時間賃率の計算!E37*P$48,NA())","v":{"$error":"#N/A"}},null,{"$f":"IF(時間賃率の計算!$C37=均等・均衡待遇のチェック!R$48,時間賃率の計算!D37,NA())","v":{"$error":"#N/A"}},{"$f":"IF(時間賃率の計算!$C37=均等・均衡待遇のチェック!R$48,時間賃率の計算!E37,NA())","v":{"$error":"#N/A"}},null,null,null,null,null,null,null,{"$f":"IF(時間賃率の計算!$C37=均等・均衡待遇のチェック!AA$48,時間賃率の計算!D37,NA())","v":""},{"$f":"IF(時間賃率の計算!$C37=均等・均衡待遇のチェック!AA$48,時間賃率の計算!E37*AB$48,NA())","v":0},null,{"$f":"IF(時間賃率の計算!$C37=均等・均衡待遇のチェック!AD$48,時間賃率の計算!D37,NA())","v":""},{"$f":"IF(時間賃率の計算!$C37=均等・均衡待遇のチェック!AD$48,時間賃率の計算!E37,NA())","v":0}]
[null,null,null,26,null,{"$f":"IF(時間賃率の計算!$C38=均等・均衡待遇のチェック!F$48,時間賃率の計算!D38,NA())","v":{"$error":"#N/A"}},{"$f":"IF(時間賃率の計算!$C38=均等・均衡待遇のチェック!F$48,時間賃率の計算!E38*G$48,NA())","v":{"$error":"#N/A"}},null,{"$f":"IF(時間賃率の計算!$C38=均等・均衡待遇のチェック!I$48,時間賃率の計算!D38,NA())","v":{"$error":"#N/A"}},{"$f":"IF(時間賃率の計算!$C38=均等・均衡待遇のチェック!I$48,時間賃率の計算!E38,NA())","v":{"$error":"#N/A"}},null,null,null,null,{"$f":"IF(時間賃率の計算!$C38=均等・均衡待遇のチェック!O$48,時間賃率の計算!D38,NA())","v":{"$error":"#N/A"}},{"$f":"IF(時間賃率の計算!$C38=均等・均衡待遇のチェック!O$48,時間賃率の計算!E38*P$48,NA())","v":{"$error":"#N/A"}},null,{"$f":"IF(時間賃率の計算!$C38=均等・均衡待遇のチェック!R$48,時間賃率の計算!D38,NA())","v":{"$error":"#N/A"}},{"$f":"IF(時間賃率の計算!$C38=均等・均衡待遇のチェック!R$48,時間賃率の計算!E38,NA())","v":{"$error":"#N/A"}},null,null,null,null,null,null,null,{"$f":"IF(時間賃率の計算!$C38=均等・均衡待遇のチェック!AA$48,時間賃率の計算!D38,NA())","v":""},{"$f":"IF(時間賃率の計算!$C38=均等・均衡待遇のチェック!AA$48,時間賃率の計算!E38*AB$48,NA())","v":0},null,{"$f":"IF(時間賃率の計算!$C38=均等・均衡待遇のチェック!AD$48,時間賃率の計算!D38,NA())","v":""},{"$f":"IF(時間賃率の計算!$C38=均等・均衡待遇のチェック!AD$48,時間賃率の計算!E38,NA())","v":0}]
[null,null,null,27,null,{"$f":"IF(時間賃率の計算!$C39=均等・均衡待遇のチェック!F$48,時間賃率の計算!D39,NA())","v":{"$error":"#N/A"}},{"$f":"IF(時間賃率の計算!$C39=均等・均衡待遇のチェック!F$48,時間賃率の計算!E39*G$48,NA())","v":{"$error":"#N/A"}},null,{"$f":"IF(時間賃率の計算!$C39=均等・均衡待遇のチェック!I$48,時間賃率の計算!D39,NA())","v":{"$error":"#N/A"}},{"$f":"IF(時間賃率の計算!$C39=均等・均衡待遇のチェック!I$48,時間賃率の計算!E39,NA())","v":{"$error":"#N/A"}},null,null,null,null,{"$f":"IF(時間賃率の計算!$C39=均等・均衡待遇のチェック!O$48,時間賃率の計算!D39,NA())","v":{"$error":"#N/A"}},{"$f":"IF(時間賃率の計算!$C39=均等・均衡待遇のチェック!O$48,時間賃率の計算!E39*P$48,NA())","v":{"$error":"#N/A"}},null,{"$f":"IF(時間賃率の計算!$C39=均等・均衡待遇のチェック!R$48,時間賃率の計算!D39,NA())","v":{"$error":"#N/A"}},{"$f":"IF(時間賃率の計算!$C39=均等・均衡待遇のチェック!R$48,時間賃率の計算!E39,NA())","v":{"$error":"#N/A"}},null,null,null,null,null,null,null,{"$f":"IF(時間賃率の計算!$C39=均等・均衡待遇のチェック!AA$48,時間賃率の計算!D39,NA())","v":""},{"$f":"IF(時間賃率の計算!$C39=均等・均衡待遇のチェック!AA$48,時間賃率の計算!E39*AB$48,NA())","v":0},null,{"$f":"IF(時間賃率の計算!$C39=均等・均衡待遇のチェック!AD$48,時間賃率の計算!D39,NA())","v":""},{"$f":"IF(時間賃率の計算!$C39=均等・均衡待遇のチェック!AD$48,時間賃率の計算!E39,NA())","v":0}]
[null,null,null,28,null,{"$f":"IF(時間賃率の計算!$C40=均等・均衡待遇のチェック!F$48,時間賃率の計算!D40,NA())","v":{"$error":"#N/A"}},{"$f":"IF(時間賃率の計算!$C40=均等・均衡待遇のチェック!F$48,時間賃率の計算!E40*G$48,NA())","v":{"$error":"#N/A"}},null,{"$f":"IF(時間賃率の計算!$C40=均等・均衡待遇のチェック!I$48,時間賃率の計算!D40,NA())","v":{"$error":"#N/A"}},{"$f":"IF(時間賃率の計算!$C40=均等・均衡待遇のチェック!I$48,時間賃率の計算!E40,NA())","v":{"$error":"#N/A"}},null,null,null,null,{"$f":"IF(時間賃率の計算!$C40=均等・均衡待遇のチェック!O$48,時間賃率の計算!D40,NA())","v":{"$error":"#N/A"}},{"$f":"IF(時間賃率の計算!$C40=均等・均衡待遇のチェック!O$48,時間賃率の計算!E40*P$48,NA())","v":{"$error":"#N/A"}},null,{"$f":"IF(時間賃率の計算!$C40=均等・均衡待遇のチェック!R$48,時間賃率の計算!D40,NA())","v":{"$error":"#N/A"}},{"$f":"IF(時間賃率の計算!$C40=均等・均衡待遇のチェック!R$48,時間賃率の計算!E40,NA())","v":{"$error":"#N/A"}},null,null,null,null,null,null,null,{"$f":"IF(時間賃率の計算!$C40=均等・均衡待遇のチェック!AA$48,時間賃率の計算!D40,NA())","v":""},{"$f":"IF(時間賃率の計算!$C40=均等・均衡待遇のチェック!AA$48,時間賃率の計算!E40*AB$48,NA())","v":0},null,{"$f":"IF(時間賃率の計算!$C40=均等・均衡待遇のチェック!AD$48,時間賃率の計算!D40,NA())","v":""},{"$f":"IF(時間賃率の計算!$C40=均等・均衡待遇のチェック!AD$48,時間賃率の計算!E40,NA())","v":0}]
[null,null,null,29,null,{"$f":"IF(時間賃率の計算!$C41=均等・均衡待遇のチェック!F$48,時間賃率の計算!D41,NA())","v":{"$error":"#N/A"}},{"$f":"IF(時間賃率の計算!$C41=均等・均衡待遇のチェック!F$48,時間賃率の計算!E41*G$48,NA())","v":{"$error":"#N/A"}},null,{"$f":"IF(時間賃率の計算!$C41=均等・均衡待遇のチェック!I$48,時間賃率の計算!D41,NA())","v":{"$error":"#N/A"}},{"$f":"IF(時間賃率の計算!$C41=均等・均衡待遇のチェック!I$48,時間賃率の計算!E41,NA())","v":{"$error":"#N/A"}},null,null,null,null,{"$f":"IF(時間賃率の計算!$C41=均等・均衡待遇のチェック!O$48,時間賃率の計算!D41,NA())","v":{"$error":"#N/A"}},{"$f":"IF(時間賃率の計算!$C41=均等・均衡待遇のチェック!O$48,時間賃率の計算!E41*P$48,NA())","v":{"$error":"#N/A"}},null,{"$f":"IF(時間賃率の計算!$C41=均等・均衡待遇のチェック!R$48,時間賃率の計算!D41,NA())","v":{"$error":"#N/A"}},{"$f":"IF(時間賃率の計算!$C41=均等・均衡待遇のチェック!R$48,時間賃率の計算!E41,NA())","v":{"$error":"#N/A"}},null,null,null,null,null,null,null,{"$f":"IF(時間賃率の計算!$C41=均等・均衡待遇のチェック!AA$48,時間賃率の計算!D41,NA())","v":""},{"$f":"IF(時間賃率の計算!$C41=均等・均衡待遇のチェック!AA$48,時間賃率の計算!E41*AB$48,NA())","v":0},null,{"$f":"IF(時間賃率の計算!$C41=均等・均衡待遇のチェック!AD$48,時間賃率の計算!D41,NA())","v":""},{"$f":"IF(時間賃率の計算!$C41=均等・均衡待遇のチェック!AD$48,時間賃率の計算!E41,NA())","v":0}]
[null,null,null,30,null,{"$f":"IF(時間賃率の計算!$C42=均等・均衡待遇のチェック!F$48,時間賃率の計算!D42,NA())","v":{"$error":"#N/A"}},{"$f":"IF(時間賃率の計算!$C42=均等・均衡待遇のチェック!F$48,時間賃率の計算!E42*G$48,NA())","v":{"$error":"#N/A"}},null,{"$f":"IF(時間賃率の計算!$C42=均等・均衡待遇のチェック!I$48,時間賃率の計算!D42,NA())","v":{"$error":"#N/A"}},{"$f":"IF(時間賃率の計算!$C42=均等・均衡待遇のチェック!I$48,時間賃率の計算!E42,NA())","v":{"$error":"#N/A"}},null,null,null,null,{"$f":"IF(時間賃率の計算!$C42=均等・均衡待遇のチェック!O$48,時間賃率の計算!D42,NA())","v":{"$error":"#N/A"}},{"$f":"IF(時間賃率の計算!$C42=均等・均衡待遇のチェック!O$48,時間賃率の計算!E42*P$48,NA())","v":{"$error":"#N/A"}},null,{"$f":"IF(時間賃率の計算!$C42=均等・均衡待遇のチェック!R$48,時間賃率の計算!D42,NA())","v":{"$error":"#N/A"}},{"$f":"IF(時間賃率の計算!$C42=均等・均衡待遇のチェック!R$48,時間賃率の計算!E42,NA())","v":{"$error":"#N/A"}},null,null,null,null,null,null,null,{"$f":"IF(時間賃率の計算!$C42=均等・均衡待遇のチェック!AA$48,時間賃率の計算!D42,NA())","v":""},{"$f":"IF(時間賃率の計算!$C42=均等・均衡待遇のチェック!AA$48,時間賃率の計算!E42*AB$48,NA())","v":0},null,{"$f":"IF(時間賃率の計算!$C42=均等・均衡待遇のチェック!AD$48,時間賃率の計算!D42,NA())","v":""},{"$f":"IF(時間賃率の計算!$C42=均等・均衡待遇のチェック!AD$48,時間賃率の計算!E42,NA())","v":0}]
[null,null,null,31,null,{"$f":"IF(時間賃率の計算!$C43=均等・均衡待遇のチェック!F$48,時間賃率の計算!D43,NA())","v":{"$error":"#N/A"}},{"$f":"IF(時間賃率の計算!$C43=均等・均衡待遇のチェック!F$48,時間賃率の計算!E43*G$48,NA())","v":{"$error":"#N/A"}},null,{"$f":"IF(時間賃率の計算!$C43=均等・均衡待遇のチェック!I$48,時間賃率の計算!D43,NA())","v":{"$error":"#N/A"}},{"$f":"IF(時間賃率の計算!$C43=均等・均衡待遇のチェック!I$48,時間賃率の計算!E43,NA())","v":{"$error":"#N/A"}},null,null,null,null,{"$f":"IF(時間賃率の計算!$C43=均等・均衡待遇のチェック!O$48,時間賃率の計算!D43,NA())","v":{"$error":"#N/A"}},{"$f":"IF(時間賃率の計算!$C43=均等・均衡待遇のチェック!O$48,時間賃率の計算!E43*P$48,NA())","v":{"$error":"#N/A"}},null,{"$f":"IF(時間賃率の計算!$C43=均等・均衡待遇のチェック!R$48,時間賃率の計算!D43,NA())","v":{"$error":"#N/A"}},{"$f":"IF(時間賃率の計算!$C43=均等・均衡待遇のチェック!R$48,時間賃率の計算!E43,NA())","v":{"$error":"#N/A"}},null,null,null,null,null,null,null,{"$f":"IF(時間賃率の計算!$C43=均等・均衡待遇のチェック!AA$48,時間賃率の計算!D43,NA())","v":""},{"$f":"IF(時間賃率の計算!$C43=均等・均衡待遇のチェック!AA$48,時間賃率の計算!E43*AB$48,NA())","v":0},null,{"$f":"IF(時間賃率の計算!$C43=均等・均衡待遇のチェック!AD$48,時間賃率の計算!D43,NA())","v":""},{"$f":"IF(時間賃率の計算!$C43=均等・均衡待遇のチェック!AD$48,時間賃率の計算!E43,NA())","v":0}]
[null,null,null,32,null,{"$f":"IF(時間賃率の計算!$C44=均等・均衡待遇のチェック!F$48,時間賃率の計算!D44,NA())","v":{"$error":"#N/A"}},{"$f":"IF(時間賃率の計算!$C44=均等・均衡待遇のチェック!F$48,時間賃率の計算!E44*G$48,NA())","v":{"$error":"#N/A"}},null,{"$f":"IF(時間賃率の計算!$C44=均等・均衡待遇のチェック!I$48,時間賃率の計算!D44,NA())","v":{"$error":"#N/A"}},{"$f":"IF(時間賃率の計算!$C44=均等・均衡待遇のチェック!I$48,時間賃率の計算!E44,NA())","v":{"$error":"#N/A"}},null,null,null,null,{"$f":"IF(時間賃率の計算!$C44=均等・均衡待遇のチェック!O$48,時間賃率の計算!D44,NA())","v":{"$error":"#N/A"}},{"$f":"IF(時間賃率の計算!$C44=均等・均衡待遇のチェック!O$48,時間賃率の計算!E44*P$48,NA())","v":{"$error":"#N/A"}},null,{"$f":"IF(時間賃率の計算!$C44=均等・均衡待遇のチェック!R$48,時間賃率の計算!D44,NA())","v":{"$error":"#N/A"}},{"$f":"IF(時間賃率の計算!$C44=均等・均衡待遇のチェック!R$48,時間賃率の計算!E44,NA())","v":{"$error":"#N/A"}},null,null,null,null,null,null,null,{"$f":"IF(時間賃率の計算!$C44=均等・均衡待遇のチェック!AA$48,時間賃率の計算!D44,NA())","v":""},{"$f":"IF(時間賃率の計算!$C44=均等・均衡待遇のチェック!AA$48,時間賃率の計算!E44*AB$48,NA())","v":0},null,{"$f":"IF(時間賃率の計算!$C44=均等・均衡待遇のチェック!AD$48,時間賃率の計算!D44,NA())","v":""},{"$f":"IF(時間賃率の計算!$C44=均等・均衡待遇のチェック!AD$48,時間賃率の計算!E44,NA())","v":0}]
[null,null,null,33,null,{"$f":"IF(時間賃率の計算!$C45=均等・均衡待遇のチェック!F$48,時間賃率の計算!D45,NA())","v":{"$error":"#N/A"}},{"$f":"IF(時間賃率の計算!$C45=均等・均衡待遇のチェック!F$48,時間賃率の計算!E45*G$48,NA())","v":{"$error":"#N/A"}},null,{"$f":"IF(時間賃率の計算!$C45=均等・均衡待遇のチェック!I$48,時間賃率の計算!D45,NA())","v":{"$error":"#N/A"}},{"$f":"IF(時間賃率の計算!$C45=均等・均衡待遇のチェック!I$48,時間賃率の計算!E45,NA())","v":{"$error":"#N/A"}},null,null,null,null,{"$f":"IF(時間賃率の計算!$C45=均等・均衡待遇のチェック!O$48,時間賃率の計算!D45,NA())","v":{"$error":"#N/A"}},{"$f":"IF(時間賃率の計算!$C45=均等・均衡待遇のチェック!O$48,時間賃率の計算!E45*P$48,NA())","v":{"$error":"#N/A"}},null,{"$f":"IF(時間賃率の計算!$C45=均等・均衡待遇のチェック!R$48,時間賃率の計算!D45,NA())","v":{"$error":"#N/A"}},{"$f":"IF(時間賃率の計算!$C45=均等・均衡待遇のチェック!R$48,時間賃率の計算!E45,NA())","v":{"$error":"#N/A"}},null,null,null,null,null,null,null,{"$f":"IF(時間賃率の計算!$C45=均等・均衡待遇のチェック!AA$48,時間賃率の計算!D45,NA())","v":""},{"$f":"IF(時間賃率の計算!$C45=均等・均衡待遇のチェック!AA$48,時間賃率の計算!E45*AB$48,NA())","v":0},null,{"$f":"IF(時間賃率の計算!$C45=均等・均衡待遇のチェック!AD$48,時間賃率の計算!D45,NA())","v":""},{"$f":"IF(時間賃率の計算!$C45=均等・均衡待遇のチェック!AD$48,時間賃率の計算!E45,NA())","v":0}]
[null,null,null,34,null,{"$f":"IF(時間賃率の計算!$C46=均等・均衡待遇のチェック!F$48,時間賃率の計算!D46,NA())","v":{"$error":"#N/A"}},{"$f":"IF(時間賃率の計算!$C46=均等・均衡待遇のチェック!F$48,時間賃率の計算!E46*G$48,NA())","v":{"$error":"#N/A"}},null,{"$f":"IF(時間賃率の計算!$C46=均等・均衡待遇のチェック!I$48,時間賃率の計算!D46,NA())","v":{"$error":"#N/A"}},{"$f":"IF(時間賃率の計算!$C46=均等・均衡待遇のチェック!I$48,時間賃率の計算!E46,NA())","v":{"$error":"#N/A"}},null,null,null,null,{"$f":"IF(時間賃率の計算!$C46=均等・均衡待遇のチェック!O$48,時間賃率の計算!D46,NA())","v":{"$error":"#N/A"}},{"$f":"IF(時間賃率の計算!$C46=均等・均衡待遇のチェック!O$48,時間賃率の計算!E46*P$48,NA())","v":{"$error":"#N/A"}},null,{"$f":"IF(時間賃率の計算!$C46=均等・均衡待遇のチェック!R$48,時間賃率の計算!D46,NA())","v":{"$error":"#N/A"}},{"$f":"IF(時間賃率の計算!$C46=均等・均衡待遇のチェック!R$48,時間賃率の計算!E46,NA())","v":{"$error":"#N/A"}},null,null,null,null,null,null,null,{"$f":"IF(時間賃率の計算!$C46=均等・均衡待遇のチェック!AA$48,時間賃率の計算!D46,NA())","v":""},{"$f":"IF(時間賃率の計算!$C46=均等・均衡待遇のチェック!AA$48,時間賃率の計算!E46*AB$48,NA())","v":0},null,{"$f":"IF(時間賃率の計算!$C46=均等・均衡待遇のチェック!AD$48,時間賃率の計算!D46,NA())","v":""},{"$f":"IF(時間賃率の計算!$C46=均等・均衡待遇のチェック!AD$48,時間賃率の計算!E46,NA())","v":0}]
[null,null,null,35,null,{"$f":"IF(時間賃率の計算!$C47=均等・均衡待遇のチェック!F$48,時間賃率の計算!D47,NA())","v":{"$error":"#N/A"}},{"$f":"IF(時間賃率の計算!$C47=均等・均衡待遇のチェック!F$48,時間賃率の計算!E47*G$48,NA())","v":{"$error":"#N/A"}},null,{"$f":"IF(時間賃率の計算!$C47=均等・均衡待遇のチェック!I$48,時間賃率の計算!D47,NA())","v":{"$error":"#N/A"}},{"$f":"IF(時間賃率の計算!$C47=均等・均衡待遇のチェック!I$48,時間賃率の計算!E47,NA())","v":{"$error":"#N/A"}},null,null,null,null,{"$f":"IF(時間賃率の計算!$C47=均等・均衡待遇のチェック!O$48,時間賃率の計算!D47,NA())","v":{"$error":"#N/A"}},{"$f":"IF(時間賃率の計算!$C47=均等・均衡待遇のチェック!O$48,時間賃率の計算!E47*P$48,NA())","v":{"$error":"#N/A"}},null,{"$f":"IF(時間賃率の計算!$C47=均等・均衡待遇のチェック!R$48,時間賃率の計算!D47,NA())","v":{"$error":"#N/A"}},{"$f":"IF(時間賃率の計算!$C47=均等・均衡待遇のチェック!R$48,時間賃率の計算!E47,NA())","v":{"$error":"#N/A"}},null,null,null,null,null,null,null,{"$f":"IF(時間賃率の計算!$C47=均等・均衡待遇のチェック!AA$48,時間賃率の計算!D47,NA())","v":""},{"$f":"IF(時間賃率の計算!$C47=均等・均衡待遇のチェック!AA$48,時間賃率の計算!E47*AB$48,NA())","v":0},null,{"$f":"IF(時間賃率の計算!$C47=均等・均衡待遇のチェック!AD$48,時間賃率の計算!D47,NA())","v":""},{"$f":"IF(時間賃率の計算!$C47=均等・均衡待遇のチェック!AD$48,時間賃率の計算!E47,NA())","v":0}]
[null,null,null,36,null,{"$f":"IF(時間賃率の計算!$C48=均等・均衡待遇のチェック!F$48,時間賃率の計算!D48,NA())","v":{"$error":"#N/A"}},{"$f":"IF(時間賃率の計算!$C48=均等・均衡待遇のチェック!F$48,時間賃率の計算!E48*G$48,NA())","v":{"$error":"#N/A"}},null,{"$f":"IF(時間賃率の計算!$C48=均等・均衡待遇のチェック!I$48,時間賃率の計算!D48,NA())","v":{"$error":"#N/A"}},{"$f":"IF(時間賃率の計算!$C48=均等・均衡待遇のチェック!I$48,時間賃率の計算!E48,NA())","v":{"$error":"#N/A"}},null,null,null,null,{"$f":"IF(時間賃率の計算!$C48=均等・均衡待遇のチェック!O$48,時間賃率の計算!D48,NA())","v":{"$error":"#N/A"}},{"$f":"IF(時間賃率の計算!$C48=均等・均衡待遇のチェック!O$48,時間賃率の計算!E48*P$48,NA())","v":{"$error":"#N/A"}},null,{"$f":"IF(時間賃率の計算!$C48=均等・均衡待遇のチェック!R$48,時間賃率の計算!D48,NA())","v":{"$error":"#N/A"}},{"$f":"IF(時間賃率の計算!$C48=均等・均衡待遇のチェック!R$48,時間賃率の計算!E48,NA())","v":{"$error":"#N/A"}},null,null,null,null,null,null,null,{"$f":"IF(時間賃率の計算!$C48=均等・均衡待遇のチェック!AA$48,時間賃率の計算!D48,NA())","v":""},{"$f":"IF(時間賃率の計算!$C48=均等・均衡待遇のチェック!AA$48,時間賃率の計算!E48*AB$48,NA())","v":0},null,{"$f":"IF(時間賃率の計算!$C48=均等・均衡待遇のチェック!AD$48,時間賃率の計算!D48,NA())","v":""},{"$f":"IF(時間賃率の計算!$C48=均等・均衡待遇のチェック!AD$48,時間賃率の計算!E48,NA())","v":0}]
[null,null,null,37,null,{"$f":"IF(時間賃率の計算!$C49=均等・均衡待遇のチェック!F$48,時間賃率の計算!D49,NA())","v":{"$error":"#N/A"}},{"$f":"IF(時間賃率の計算!$C49=均等・均衡待遇のチェック!F$48,時間賃率の計算!E49*G$48,NA())","v":{"$error":"#N/A"}},null,{"$f":"IF(時間賃率の計算!$C49=均等・均衡待遇のチェック!I$48,時間賃率の計算!D49,NA())","v":{"$error":"#N/A"}},{"$f":"IF(時間賃率の計算!$C49=均等・均衡待遇のチェック!I$48,時間賃率の計算!E49,NA())","v":{"$error":"#N/A"}},null,null,null,null,{"$f":"IF(時間賃率の計算!$C49=均等・均衡待遇のチェック!O$48,時間賃率の計算!D49,NA())","v":{"$error":"#N/A"}},{"$f":"IF(時間賃率の計算!$C49=均等・均衡待遇のチェック!O$48,時間賃率の計算!E49*P$48,NA())","v":{"$error":"#N/A"}},null,{"$f":"IF(時間賃率の計算!$C49=均等・均衡待遇のチェック!R$48,時間賃率の計算!D49,NA())","v":{"$error":"#N/A"}},{"$f":"IF(時間賃率の計算!$C49=均等・均衡待遇のチェック!R$48,時間賃率の計算!E49,NA())","v":{"$error":"#N/A"}},null,null,null,null,null,null,null,{"$f":"IF(時間賃率の計算!$C49=均等・均衡待遇のチェック!AA$48,時間賃率の計算!D49,NA())","v":""},{"$f":"IF(時間賃率の計算!$C49=均等・均衡待遇のチェック!AA$48,時間賃率の計算!E49*AB$48,NA())","v":0},null,{"$f":"IF(時間賃率の計算!$C49=均等・均衡待遇のチェック!AD$48,時間賃率の計算!D49,NA())","v":""},{"$f":"IF(時間賃率の計算!$C49=均等・均衡待遇のチェック!AD$48,時間賃率の計算!E49,NA())","v":0}]
[null,null,null,38,null,{"$f":"IF(時間賃率の計算!$C50=均等・均衡待遇のチェック!F$48,時間賃率の計算!D50,NA())","v":{"$error":"#N/A"}},{"$f":"IF(時間賃率の計算!$C50=均等・均衡待遇のチェック!F$48,時間賃率の計算!E50*G$48,NA())","v":{"$error":"#N/A"}},null,{"$f":"IF(時間賃率の計算!$C50=均等・均衡待遇のチェック!I$48,時間賃率の計算!D50,NA())","v":{"$error":"#N/A"}},{"$f":"IF(時間賃率の計算!$C50=均等・均衡待遇のチェック!I$48,時間賃率の計算!E50,NA())","v":{"$error":"#N/A"}},null,null,null,null,{"$f":"IF(時間賃率の計算!$C50=均等・均衡待遇のチェック!O$48,時間賃率の計算!D50,NA())","v":{"$error":"#N/A"}},{"$f":"IF(時間賃率の計算!$C50=均等・均衡待遇のチェック!O$48,時間賃率の計算!E50*P$48,NA())","v":{"$error":"#N/A"}},null,{"$f":"IF(時間賃率の計算!$C50=均等・均衡待遇のチェック!R$48,時間賃率の計算!D50,NA())","v":{"$error":"#N/A"}},{"$f":"IF(時間賃率の計算!$C50=均等・均衡待遇のチェック!R$48,時間賃率の計算!E50,NA())","v":{"$error":"#N/A"}},null,null,null,null,null,null,null,{"$f":"IF(時間賃率の計算!$C50=均等・均衡待遇のチェック!AA$48,時間賃率の計算!D50,NA())","v":""},{"$f":"IF(時間賃率の計算!$C50=均等・均衡待遇のチェック!AA$48,時間賃率の計算!E50*AB$48,NA())","v":0},null,{"$f":"IF(時間賃率の計算!$C50=均等・均衡待遇のチェック!AD$48,時間賃率の計算!D50,NA())","v":""},{"$f":"IF(時間賃率の計算!$C50=均等・均衡待遇のチェック!AD$48,時間賃率の計算!E50,NA())","v":0}]
[null,null,null,39,null,{"$f":"IF(時間賃率の計算!$C51=均等・均衡待遇のチェック!F$48,時間賃率の計算!D51,NA())","v":{"$error":"#N/A"}},{"$f":"IF(時間賃率の計算!$C51=均等・均衡待遇のチェック!F$48,時間賃率の計算!E51*G$48,NA())","v":{"$error":"#N/A"}},null,{"$f":"IF(時間賃率の計算!$C51=均等・均衡待遇のチェック!I$48,時間賃率の計算!D51,NA())","v":{"$error":"#N/A"}},{"$f":"IF(時間賃率の計算!$C51=均等・均衡待遇のチェック!I$48,時間賃率の計算!E51,NA())","v":{"$error":"#N/A"}},null,null,null,null,{"$f":"IF(時間賃率の計算!$C51=均等・均衡待遇のチェック!O$48,時間賃率の計算!D51,NA())","v":{"$error":"#N/A"}},{"$f":"IF(時間賃率の計算!$C51=均等・均衡待遇のチェック!O$48,時間賃率の計算!E51*P$48,NA())","v":{"$error":"#N/A"}},null,{"$f":"IF(時間賃率の計算!$C51=均等・均衡待遇のチェック!R$48,時間賃率の計算!D51,NA())","v":{"$error":"#N/A"}},{"$f":"IF(時間賃率の計算!$C51=均等・均衡待遇のチェック!R$48,時間賃率の計算!E51,NA())","v":{"$error":"#N/A"}},null,null,null,null,null,null,null,{"$f":"IF(時間賃率の計算!$C51=均等・均衡待遇のチェック!AA$48,時間賃率の計算!D51,NA())","v":""},{"$f":"IF(時間賃率の計算!$C51=均等・均衡待遇のチェック!AA$48,時間賃率の計算!E51*AB$48,NA())","v":0},null,{"$f":"IF(時間賃率の計算!$C51=均等・均衡待遇のチェック!AD$48,時間賃率の計算!D51,NA())","v":""},{"$f":"IF(時間賃率の計算!$C51=均等・均衡待遇のチェック!AD$48,時間賃率の計算!E51,NA())","v":0}]
[null,null,null,40,null,{"$f":"IF(時間賃率の計算!$C52=均等・均衡待遇のチェック!F$48,時間賃率の計算!D52,NA())","v":{"$error":"#N/A"}},{"$f":"IF(時間賃率の計算!$C52=均等・均衡待遇のチェック!F$48,時間賃率の計算!E52*G$48,NA())","v":{"$error":"#N/A"}},null,{"$f":"IF(時間賃率の計算!$C52=均等・均衡待遇のチェック!I$48,時間賃率の計算!D52,NA())","v":{"$error":"#N/A"}},{"$f":"IF(時間賃率の計算!$C52=均等・均衡待遇のチェック!I$48,時間賃率の計算!E52,NA())","v":{"$error":"#N/A"}},null,null,null,null,{"$f":"IF(時間賃率の計算!$C52=均等・均衡待遇のチェック!O$48,時間賃率の計算!D52,NA())","v":{"$error":"#N/A"}},{"$f":"IF(時間賃率の計算!$C52=均等・均衡待遇のチェック!O$48,時間賃率の計算!E52*P$48,NA())","v":{"$error":"#N/A"}},null,{"$f":"IF(時間賃率の計算!$C52=均等・均衡待遇のチェック!R$48,時間賃率の計算!D52,NA())","v":{"$error":"#N/A"}},{"$f":"IF(時間賃率の計算!$C52=均等・均衡待遇のチェック!R$48,時間賃率の計算!E52,NA())","v":{"$error":"#N/A"}},null,null,null,null,null,null,null,{"$f":"IF(時間賃率の計算!$C52=均等・均衡待遇のチェック!AA$48,時間賃率の計算!D52,NA())","v":""},{"$f":"IF(時間賃率の計算!$C52=均等・均衡待遇のチェック!AA$48,時間賃率の計算!E52*AB$48,NA())","v":0},null,{"$f":"IF(時間賃率の計算!$C52=均等・均衡待遇のチェック!AD$48,時間賃率の計算!D52,NA())","v":""},{"$f":"IF(時間賃率の計算!$C52=均等・均衡待遇のチェック!AD$48,時間賃率の計算!E52,NA())","v":0}]
[null,null,null,41,null,{"$f":"IF(時間賃率の計算!$C53=均等・均衡待遇のチェック!F$48,時間賃率の計算!D53,NA())","v":{"$error":"#N/A"}},{"$f":"IF(時間賃率の計算!$C53=均等・均衡待遇のチェック!F$48,時間賃率の計算!E53*G$48,NA())","v":{"$error":"#N/A"}},null,{"$f":"IF(時間賃率の計算!$C53=均等・均衡待遇のチェック!I$48,時間賃率の計算!D53,NA())","v":{"$error":"#N/A"}},{"$f":"IF(時間賃率の計算!$C53=均等・均衡待遇のチェック!I$48,時間賃率の計算!E53,NA())","v":{"$error":"#N/A"}},null,null,null,null,{"$f":"IF(時間賃率の計算!$C53=均等・均衡待遇のチェック!O$48,時間賃率の計算!D53,NA())","v":{"$error":"#N/A"}},{"$f":"IF(時間賃率の計算!$C53=均等・均衡待遇のチェック!O$48,時間賃率の計算!E53*P$48,NA())","v":{"$error":"#N/A"}},null,{"$f":"IF(時間賃率の計算!$C53=均等・均衡待遇のチェック!R$48,時間賃率の計算!D53,NA())","v":{"$error":"#N/A"}},{"$f":"IF(時間賃率の計算!$C53=均等・均衡待遇のチェック!R$48,時間賃率の計算!E53,NA())","v":{"$error":"#N/A"}},null,null,null,null,null,null,null,{"$f":"IF(時間賃率の計算!$C53=均等・均衡待遇のチェック!AA$48,時間賃率の計算!D53,NA())","v":""},{"$f":"IF(時間賃率の計算!$C53=均等・均衡待遇のチェック!AA$48,時間賃率の計算!E53*AB$48,NA())","v":0},null,{"$f":"IF(時間賃率の計算!$C53=均等・均衡待遇のチェック!AD$48,時間賃率の計算!D53,NA())","v":""},{"$f":"IF(時間賃率の計算!$C53=均等・均衡待遇のチェック!AD$48,時間賃率の計算!E53,NA())","v":0}]
[null,null,null,42,null,{"$f":"IF(時間賃率の計算!$C54=均等・均衡待遇のチェック!F$48,時間賃率の計算!D54,NA())","v":{"$error":"#N/A"}},{"$f":"IF(時間賃率の計算!$C54=均等・均衡待遇のチェック!F$48,時間賃率の計算!E54*G$48,NA())","v":{"$error":"#N/A"}},null,{"$f":"IF(時間賃率の計算!$C54=均等・均衡待遇のチェック!I$48,時間賃率の計算!D54,NA())","v":{"$error":"#N/A"}},{"$f":"IF(時間賃率の計算!$C54=均等・均衡待遇のチェック!I$48,時間賃率の計算!E54,NA())","v":{"$error":"#N/A"}},null,null,null,null,{"$f":"IF(時間賃率の計算!$C54=均等・均衡待遇のチェック!O$48,時間賃率の計算!D54,NA())","v":{"$error":"#N/A"}},{"$f":"IF(時間賃率の計算!$C54=均等・均衡待遇のチェック!O$48,時間賃率の計算!E54*P$48,NA())","v":{"$error":"#N/A"}},null,{"$f":"IF(時間賃率の計算!$C54=均等・均衡待遇のチェック!R$48,時間賃率の計算!D54,NA())","v":{"$error":"#N/A"}},{"$f":"IF(時間賃率の計算!$C54=均等・均衡待遇のチェック!R$48,時間賃率の計算!E54,NA())","v":{"$error":"#N/A"}},null,null,null,null,null,null,null,{"$f":"IF(時間賃率の計算!$C54=均等・均衡待遇のチェック!AA$48,時間賃率の計算!D54,NA())","v":""},{"$f":"IF(時間賃率の計算!$C54=均等・均衡待遇のチェック!AA$48,時間賃率の計算!E54*AB$48,NA())","v":0},null,{"$f":"IF(時間賃率の計算!$C54=均等・均衡待遇のチェック!AD$48,時間賃率の計算!D54,NA())","v":""},{"$f":"IF(時間賃率の計算!$C54=均等・均衡待遇のチェック!AD$48,時間賃率の計算!E54,NA())","v":0}]
[null,null,null,43,null,{"$f":"IF(時間賃率の計算!$C55=均等・均衡待遇のチェック!F$48,時間賃率の計算!D55,NA())","v":{"$error":"#N/A"}},{"$f":"IF(時間賃率の計算!$C55=均等・均衡待遇のチェック!F$48,時間賃率の計算!E55*G$48,NA())","v":{"$error":"#N/A"}},null,{"$f":"IF(時間賃率の計算!$C55=均等・均衡待遇のチェック!I$48,時間賃率の計算!D55,NA())","v":{"$error":"#N/A"}},{"$f":"IF(時間賃率の計算!$C55=均等・均衡待遇のチェック!I$48,時間賃率の計算!E55,NA())","v":{"$error":"#N/A"}},null,null,null,null,{"$f":"IF(時間賃率の計算!$C55=均等・均衡待遇のチェック!O$48,時間賃率の計算!D55,NA())","v":{"$error":"#N/A"}},{"$f":"IF(時間賃率の計算!$C55=均等・均衡待遇のチェック!O$48,時間賃率の計算!E55*P$48,NA())","v":{"$error":"#N/A"}},null,{"$f":"IF(時間賃率の計算!$C55=均等・均衡待遇のチェック!R$48,時間賃率の計算!D55,NA())","v":{"$error":"#N/A"}},{"$f":"IF(時間賃率の計算!$C55=均等・均衡待遇のチェック!R$48,時間賃率の計算!E55,NA())","v":{"$error":"#N/A"}},null,null,null,null,null,null,null,{"$f":"IF(時間賃率の計算!$C55=均等・均衡待遇のチェック!AA$48,時間賃率の計算!D55,NA())","v":""},{"$f":"IF(時間賃率の計算!$C55=均等・均衡待遇のチェック!AA$48,時間賃率の計算!E55*AB$48,NA())","v":0},null,{"$f":"IF(時間賃率の計算!$C55=均等・均衡待遇のチェック!AD$48,時間賃率の計算!D55,NA())","v":""},{"$f":"IF(時間賃率の計算!$C55=均等・均衡待遇のチェック!AD$48,時間賃率の計算!E55,NA())","v":0}]
[null,null,null,44,null,{"$f":"IF(時間賃率の計算!$C56=均等・均衡待遇のチェック!F$48,時間賃率の計算!D56,NA())","v":{"$error":"#N/A"}},{"$f":"IF(時間賃率の計算!$C56=均等・均衡待遇のチェック!F$48,時間賃率の計算!E56*G$48,NA())","v":{"$error":"#N/A"}},null,{"$f":"IF(時間賃率の計算!$C56=均等・均衡待遇のチェック!I$48,時間賃率の計算!D56,NA())","v":{"$error":"#N/A"}},{"$f":"IF(時間賃率の計算!$C56=均等・均衡待遇のチェック!I$48,時間賃率の計算!E56,NA())","v":{"$error":"#N/A"}},null,null,null,null,{"$f":"IF(時間賃率の計算!$C56=均等・均衡待遇のチェック!O$48,時間賃率の計算!D56,NA())","v":{"$error":"#N/A"}},{"$f":"IF(時間賃率の計算!$C56=均等・均衡待遇のチェック!O$48,時間賃率の計算!E56*P$48,NA())","v":{"$error":"#N/A"}},null,{"$f":"IF(時間賃率の計算!$C56=均等・均衡待遇のチェック!R$48,時間賃率の計算!D56,NA())","v":{"$error":"#N/A"}},{"$f":"IF(時間賃率の計算!$C56=均等・均衡待遇のチェック!R$48,時間賃率の計算!E56,NA())","v":{"$error":"#N/A"}},null,null,null,null,null,null,null,{"$f":"IF(時間賃率の計算!$C56=均等・均衡待遇のチェック!AA$48,時間賃率の計算!D56,NA())","v":""},{"$f":"IF(時間賃率の計算!$C56=均等・均衡待遇のチェック!AA$48,時間賃率の計算!E56*AB$48,NA())","v":0},null,{"$f":"IF(時間賃率の計算!$C56=均等・均衡待遇のチェック!AD$48,時間賃率の計算!D56,NA())","v":""},{"$f":"IF(時間賃率の計算!$C56=均等・均衡待遇のチェック!AD$48,時間賃率の計算!E56,NA())","v":0}]
[null,null,null,45,null,{"$f":"IF(時間賃率の計算!$C57=均等・均衡待遇のチェック!F$48,時間賃率の計算!D57,NA())","v":{"$error":"#N/A"}},{"$f":"IF(時間賃率の計算!$C57=均等・均衡待遇のチェック!F$48,時間賃率の計算!E57*G$48,NA())","v":{"$error":"#N/A"}},null,{"$f":"IF(時間賃率の計算!$C57=均等・均衡待遇のチェック!I$48,時間賃率の計算!D57,NA())","v":{"$error":"#N/A"}},{"$f":"IF(時間賃率の計算!$C57=均等・均衡待遇のチェック!I$48,時間賃率の計算!E57,NA())","v":{"$error":"#N/A"}},null,null,null,null,{"$f":"IF(時間賃率の計算!$C57=均等・均衡待遇のチェック!O$48,時間賃率の計算!D57,NA())","v":{"$error":"#N/A"}},{"$f":"IF(時間賃率の計算!$C57=均等・均衡待遇のチェック!O$48,時間賃率の計算!E57*P$48,NA())","v":{"$error":"#N/A"}},null,{"$f":"IF(時間賃率の計算!$C57=均等・均衡待遇のチェック!R$48,時間賃率の計算!D57,NA())","v":{"$error":"#N/A"}},{"$f":"IF(時間賃率の計算!$C57=均等・均衡待遇のチェック!R$48,時間賃率の計算!E57,NA())","v":{"$error":"#N/A"}},null,null,null,null,null,null,null,{"$f":"IF(時間賃率の計算!$C57=均等・均衡待遇のチェック!AA$48,時間賃率の計算!D57,NA())","v":""},{"$f":"IF(時間賃率の計算!$C57=均等・均衡待遇のチェック!AA$48,時間賃率の計算!E57*AB$48,NA())","v":0},null,{"$f":"IF(時間賃率の計算!$C57=均等・均衡待遇のチェック!AD$48,時間賃率の計算!D57,NA())","v":""},{"$f":"IF(時間賃率の計算!$C57=均等・均衡待遇のチェック!AD$48,時間賃率の計算!E57,NA())","v":0}]
[null,null,null,46,null,{"$f":"IF(時間賃率の計算!$C58=均等・均衡待遇のチェック!F$48,時間賃率の計算!D58,NA())","v":{"$error":"#N/A"}},{"$f":"IF(時間賃率の計算!$C58=均等・均衡待遇のチェック!F$48,時間賃率の計算!E58*G$48,NA())","v":{"$error":"#N/A"}},null,{"$f":"IF(時間賃率の計算!$C58=均等・均衡待遇のチェック!I$48,時間賃率の計算!D58,NA())","v":{"$error":"#N/A"}},{"$f":"IF(時間賃率の計算!$C58=均等・均衡待遇のチェック!I$48,時間賃率の計算!E58,NA())","v":{"$error":"#N/A"}},null,null,null,null,{"$f":"IF(時間賃率の計算!$C58=均等・均衡待遇のチェック!O$48,時間賃率の計算!D58,NA())","v":{"$error":"#N/A"}},{"$f":"IF(時間賃率の計算!$C58=均等・均衡待遇のチェック!O$48,時間賃率の計算!E58*P$48,NA())","v":{"$error":"#N/A"}},null,{"$f":"IF(時間賃率の計算!$C58=均等・均衡待遇のチェック!R$48,時間賃率の計算!D58,NA())","v":{"$error":"#N/A"}},{"$f":"IF(時間賃率の計算!$C58=均等・均衡待遇のチェック!R$48,時間賃率の計算!E58,NA())","v":{"$error":"#N/A"}},null,null,null,null,null,null,null,{"$f":"IF(時間賃率の計算!$C58=均等・均衡待遇のチェック!AA$48,時間賃率の計算!D58,NA())","v":""},{"$f":"IF(時間賃率の計算!$C58=均等・均衡待遇のチェック!AA$48,時間賃率の計算!E58*AB$48,NA())","v":0},null,{"$f":"IF(時間賃率の計算!$C58=均等・均衡待遇のチェック!AD$48,時間賃率の計算!D58,NA())","v":""},{"$f":"IF(時間賃率の計算!$C58=均等・均衡待遇のチェック!AD$48,時間賃率の計算!E58,NA())","v":0}]
[null,null,null,47,null,{"$f":"IF(時間賃率の計算!$C59=均等・均衡待遇のチェック!F$48,時間賃率の計算!D59,NA())","v":{"$error":"#N/A"}},{"$f":"IF(時間賃率の計算!$C59=均等・均衡待遇のチェック!F$48,時間賃率の計算!E59*G$48,NA())","v":{"$error":"#N/A"}},null,{"$f":"IF(時間賃率の計算!$C59=均等・均衡待遇のチェック!I$48,時間賃率の計算!D59,NA())","v":{"$error":"#N/A"}},{"$f":"IF(時間賃率の計算!$C59=均等・均衡待遇のチェック!I$48,時間賃率の計算!E59,NA())","v":{"$error":"#N/A"}},null,null,null,null,{"$f":"IF(時間賃率の計算!$C59=均等・均衡待遇のチェック!O$48,時間賃率の計算!D59,NA())","v":{"$error":"#N/A"}},{"$f":"IF(時間賃率の計算!$C59=均等・均衡待遇のチェック!O$48,時間賃率の計算!E59*P$48,NA())","v":{"$error":"#N/A"}},null,{"$f":"IF(時間賃率の計算!$C59=均等・均衡待遇のチェック!R$48,時間賃率の計算!D59,NA())","v":{"$error":"#N/A"}},{"$f":"IF(時間賃率の計算!$C59=均等・均衡待遇のチェック!R$48,時間賃率の計算!E59,NA())","v":{"$error":"#N/A"}},null,null,null,null,null,null,null,{"$f":"IF(時間賃率の計算!$C59=均等・均衡待遇のチェック!AA$48,時間賃率の計算!D59,NA())","v":""},{"$f":"IF(時間賃率の計算!$C59=均等・均衡待遇のチェック!AA$48,時間賃率の計算!E59*AB$48,NA())","v":0},null,{"$f":"IF(時間賃率の計算!$C59=均等・均衡待遇のチェック!AD$48,時間賃率の計算!D59,NA())","v":""},{"$f":"IF(時間賃率の計算!$C59=均等・均衡待遇のチェック!AD$48,時間賃率の計算!E59,NA())","v":0}]
[null,null,null,48,null,{"$f":"IF(時間賃率の計算!$C60=均等・均衡待遇のチェック!F$48,時間賃率の計算!D60,NA())","v":{"$error":"#N/A"}},{"$f":"IF(時間賃率の計算!$C60=均等・均衡待遇のチェック!F$48,時間賃率の計算!E60*G$48,NA())","v":{"$error":"#N/A"}},null,{"$f":"IF(時間賃率の計算!$C60=均等・均衡待遇のチェック!I$48,時間賃率の計算!D60,NA())","v":{"$error":"#N/A"}},{"$f":"IF(時間賃率の計算!$C60=均等・均衡待遇のチェック!I$48,時間賃率の計算!E60,NA())","v":{"$error":"#N/A"}},null,null,null,null,{"$f":"IF(時間賃率の計算!$C60=均等・均衡待遇のチェック!O$48,時間賃率の計算!D60,NA())","v":{"$error":"#N/A"}},{"$f":"IF(時間賃率の計算!$C60=均等・均衡待遇のチェック!O$48,時間賃率の計算!E60*P$48,NA())","v":{"$error":"#N/A"}},null,{"$f":"IF(時間賃率の計算!$C60=均等・均衡待遇のチェック!R$48,時間賃率の計算!D60,NA())","v":{"$error":"#N/A"}},{"$f":"IF(時間賃率の計算!$C60=均等・均衡待遇のチェック!R$48,時間賃率の計算!E60,NA())","v":{"$error":"#N/A"}},null,null,null,null,null,null,null,{"$f":"IF(時間賃率の計算!$C60=均等・均衡待遇のチェック!AA$48,時間賃率の計算!D60,NA())","v":""},{"$f":"IF(時間賃率の計算!$C60=均等・均衡待遇のチェック!AA$48,時間賃率の計算!E60*AB$48,NA())","v":0},null,{"$f":"IF(時間賃率の計算!$C60=均等・均衡待遇のチェック!AD$48,時間賃率の計算!D60,NA())","v":""},{"$f":"IF(時間賃率の計算!$C60=均等・均衡待遇のチェック!AD$48,時間賃率の計算!E60,NA())","v":0}]
[null,null,null,49,null,{"$f":"IF(時間賃率の計算!$C61=均等・均衡待遇のチェック!F$48,時間賃率の計算!D61,NA())","v":{"$error":"#N/A"}},{"$f":"IF(時間賃率の計算!$C61=均等・均衡待遇のチェック!F$48,時間賃率の計算!E61*G$48,NA())","v":{"$error":"#N/A"}},null,{"$f":"IF(時間賃率の計算!$C61=均等・均衡待遇のチェック!I$48,時間賃率の計算!D61,NA())","v":{"$error":"#N/A"}},{"$f":"IF(時間賃率の計算!$C61=均等・均衡待遇のチェック!I$48,時間賃率の計算!E61,NA())","v":{"$error":"#N/A"}},null,null,null,null,{"$f":"IF(時間賃率の計算!$C61=均等・均衡待遇のチェック!O$48,時間賃率の計算!D61,NA())","v":{"$error":"#N/A"}},{"$f":"IF(時間賃率の計算!$C61=均等・均衡待遇のチェック!O$48,時間賃率の計算!E61*P$48,NA())","v":{"$error":"#N/A"}},null,{"$f":"IF(時間賃率の計算!$C61=均等・均衡待遇のチェック!R$48,時間賃率の計算!D61,NA())","v":{"$error":"#N/A"}},{"$f":"IF(時間賃率の計算!$C61=均等・均衡待遇のチェック!R$48,時間賃率の計算!E61,NA())","v":{"$error":"#N/A"}},null,null,null,null,null,null,null,{"$f":"IF(時間賃率の計算!$C61=均等・均衡待遇のチェック!AA$48,時間賃率の計算!D61,NA())","v":""},{"$f":"IF(時間賃率の計算!$C61=均等・均衡待遇のチェック!AA$48,時間賃率の計算!E61*AB$48,NA())","v":0},null,{"$f":"IF(時間賃率の計算!$C61=均等・均衡待遇のチェック!AD$48,時間賃率の計算!D61,NA())","v":""},{"$f":"IF(時間賃率の計算!$C61=均等・均衡待遇のチェック!AD$48,時間賃率の計算!E61,NA())","v":0}]
[null,null,null,50,null,{"$f":"IF(時間賃率の計算!$C62=均等・均衡待遇のチェック!F$48,時間賃率の計算!D62,NA())","v":{"$error":"#N/A"}},{"$f":"IF(時間賃率の計算!$C62=均等・均衡待遇のチェック!F$48,時間賃率の計算!E62*G$48,NA())","v":{"$error":"#N/A"}},null,{"$f":"IF(時間賃率の計算!$C62=均等・均衡待遇のチェック!I$48,時間賃率の計算!D62,NA())","v":{"$error":"#N/A"}},{"$f":"IF(時間賃率の計算!$C62=均等・均衡待遇のチェック!I$48,時間賃率の計算!E62,NA())","v":{"$error":"#N/A"}},null,null,null,null,{"$f":"IF(時間賃率の計算!$C62=均等・均衡待遇のチェック!O$48,時間賃率の計算!D62,NA())","v":{"$error":"#N/A"}},{"$f":"IF(時間賃率の計算!$C62=均等・均衡待遇のチェック!O$48,時間賃率の計算!E62*P$48,NA())","v":{"$error":"#N/A"}},null,{"$f":"IF(時間賃率の計算!$C62=均等・均衡待遇のチェック!R$48,時間賃率の計算!D62,NA())","v":{"$error":"#N/A"}},{"$f":"IF(時間賃率の計算!$C62=均等・均衡待遇のチェック!R$48,時間賃率の計算!E62,NA())","v":{"$error":"#N/A"}},null,null,null,null,null,null,null,{"$f":"IF(時間賃率の計算!$C62=均等・均衡待遇のチェック!AA$48,時間賃率の計算!D62,NA())","v":""},{"$f":"IF(時間賃率の計算!$C62=均等・均衡待遇のチェック!AA$48,時間賃率の計算!E62*AB$48,NA())","v":0},null,{"$f":"IF(時間賃率の計算!$C62=均等・均衡待遇のチェック!AD$48,時間賃率の計算!D62,NA())","v":""},{"$f":"IF(時間賃率の計算!$C62=均等・均衡待遇のチェック!AD$48,時間賃率の計算!E62,NA())","v":0}]

{"sheet":"(List)職務評価結果一覧","index":9,"n_rows":118,"n_cols":16,"rows_kept":118,"cut":false,"hidden":true,"merged":[]}
["職務評価結果一覧　※ 評価結果は新しいものが適用されます ※"]
[null,"評価実施日","社員No","社員タイプ","人材代替性","革新性","専門性","裁量性","対人関係の複雑さ（部門外／社外）","対人関係の複雑さ\n（部門内）","問題解決の困難度","経営への影響度",{"$f":"'職務(役割)評価'!G22","v":""},{"$f":"'職務(役割)評価'!G23","v":""},{"$f":"'職務(役割)評価'!G24","v":""},"合計"]
[null,"2020-03-30T13:18:16.280","B004","総合職",1,1,2,2,1,2,2,2,"","","",13]
[null,"2020-03-30T13:15:00.860","B005","総合職",2,1,1,2,2,2,2,2,"","","",14]
[null,"2020-03-30T13:14:59.390","B004","総合職",1,1,2,2,1,2,2,2,"","","",13]
[null,"2020-03-30T13:14:52.900","P004","総合職",2,2,1,1,1,2,1,1,"","","",11]
[null,"2020-03-30T13:14:50.020","P004","総合職",2,2,1,1,1,2,1,1,"","","",11]
[null,"2020-03-30T13:14:48","P004","(対象外)　アシスタント",2,2,1,1,1,2,1,1,"","","",11]
[null,"2020-03-30T13:14:45.840","P003","サポート",1,1,1,2,1,1,2,1,"","","",10]
[null,"2020-03-30T13:14:43.080","P002","サポート",1,2,1,1,1,1,2,2,"","","",11]
[null,"2020-03-30T13:14:41.270","P001","サポート",1,1,1,1,1,1,1,1,"","","",8]
[null,"2020-03-30T13:14:39.440",0,"サポート",2,1,2,2,2,2,1,2,"","","",14]
[null,"2020-03-30T13:14:36.470",0,"サポート",2,1,2,2,2,2,1,2,"","","",14]
[null,"2020-03-30T13:14:35.130",0,"",2,1,2,2,2,2,1,2,"","","",14]
[]
[null,"2020-03-30T13:14:14.460","P006","パート１",1,2,2,2,2,1,1,2,"","","",13]
[null,"2020-03-30T13:14:09.240","P007","パート１",2,1,1,1,1,1,1,2,"","","",10]
[null,"2020-03-30T13:14:07.590","P005","パート１",1,1,1,1,1,1,1,1,"","","",8]
[null,"2020-03-30T13:14:06.190","P007","パート１",2,1,1,1,1,1,1,2,"","","",10]
[null,"2020-03-30T13:14:02.560","P005","パート１",1,1,1,1,1,1,1,1,"","","",8]
[null,"2020-03-30T13:13:48.560","P006","パート１",1,2,2,2,2,1,1,2,"","","",13]
[null,"2020-03-30T13:13:47.340","P008","パート１",2,1,2,1,2,2,2,3,"","","",15]
[null,"2020-03-30T13:13:45.580","P008","パート１",2,1,2,1,2,2,2,3,"","","",15]
[null,"2020-03-30T13:13:44.410","P008","サポート",2,1,2,1,2,2,2,3,"","","",15]
[null,"2019-08-23T22:16:14.070","P008","エキスパート",2,1,2,1,2,2,2,3,"","","",15]
[null,"2019-08-23T22:15:54.630","P005","エキスパート",1,1,1,1,1,1,1,1,"","","",8]
[null,"2019-08-23T22:15:52.880","B006","エキスパート",4,1,2,2,2,2,1,1,"","","",15]
[null,"2019-08-23T22:15:22.600","B006","エキスパート",4,1,2,2,2,2,1,1,"","","",15]
[null,"2019-08-23T22:15:07.010","B006","エキスパート",2,1,2,2,2,2,3,1,"","","",15]
[null,"2019-08-23T22:14:11.260","B006","サポート",2,1,2,2,2,2,3,1,"","","",15]
[null,"2019-08-23T22:14:01.790","B006","サポート",2,1,2,2,2,2,3,1,"","","",15]
[null,"2019-08-23T21:46:27.780","B006","サポート",2,1,2,2,2,2,3,1,"","","",15]
[null,"2019-08-23T21:40:57.400","B006","サポート",2,1,2,2,2,2,3,1,"","","",15]
[null,"2019-08-23T21:40:50.780","B006","サポート",2,1,1,2,2,2,3,1,"","","",14]
[null,"2019-08-23T21:40:47.840","P003","総合職",1,1,1,2,1,1,2,1,"","","",10]
[null,"2019-08-23T21:38:05.340","P003","総合職",1,1,1,2,1,1,2,1,"","","",10]
[null,"2019-08-23T21:37:59.030","P003","総合職",1,1,1,2,1,1,2,1,"","","",10]
[null,"2019-08-23T21:37:57.360","P003","(対象外)　一般職",1,1,1,2,1,1,2,1,"","","",10]
[null,"2019-08-23T21:37:55.050","P003","(対象外)　アシスタント",1,1,1,2,1,1,2,1,"","","",10]
[null,"2019-08-23T21:37:49.770","P003","エキスパート",1,1,1,2,1,1,2,1,"","","",10]
[null,"2019-08-23T18:16:41.830","P003","総合職",1,1,1,2,1,1,2,1,"","","",10]
[null,"2019-08-23T18:16:39.970","P003","",1,1,1,2,1,1,2,1,"","","",10]
[null,"2019-08-23T18:16:36.340","P003","エキスパート",1,1,1,2,1,1,2,1,"","","",10]
[null,"2019-08-23T18:16:33.410","P003","サポート",1,1,1,2,1,1,2,1,"","","",10]
[null,"2019-08-23T18:16:29.330","P003","一般職",1,1,1,2,1,1,2,1,"","","",10]
[null,"2019-08-23T18:16:26.050","P003","",1,1,1,2,1,1,2,1,"","","",10]
[null,"2019-08-23T18:16:19.390","P003","総合職",1,1,1,2,1,1,2,1,"","","",10]
[null,"2019-08-23T18:15:16.850","P003","サポート",1,1,1,2,1,1,2,1,"","","",10]
[null,"2019-08-23T18:15:13.730","P003","サポート",1,1,1,2,1,1,2,1,"","","",10]
[null,"2019-08-23T18:15:11.030","P003","サポート",1,1,1,2,1,1,2,1,"","","",10]
[null,"2019-08-23T15:12:41.030","P003","サポート",1,1,1,2,1,1,2,1,"","","",10]
[null,"2019-08-22T20:26:25.380","P003","サポート",1,1,1,2,1,1,2,1,"","","",10]
[null,"2019-08-22T20:26:17.920","P002","エキスパート",1,2,1,1,1,1,2,2,"","","",11]
[null,"2019-08-22T20:26:09.860","P001","エキスパート",1,1,1,1,1,1,1,1,"","","",8]
[null,"2019-08-22T20:25:47.440","P002","エキスパート",1,2,1,1,1,1,2,2,3,"","",14]
[null,"2019-08-22T20:24:18.310","P002","エキスパート",1,2,1,1,1,1,2,2,"","","",11]
[null,"2019-08-22T20:24:15.760","P002","総合職",1,2,1,1,1,1,2,2,"","","",11]
[null,"2019-08-22T20:24:13.520","P002","一般職",1,2,1,1,1,1,2,2,"","","",11]
[null,"2019-08-22T20:24:09.420","P002","サポート",1,2,1,1,1,1,2,2,"","","",11]
[null,"2019-08-22T20:24:07.650","P002","",1,2,1,1,1,1,2,2,"","","",11]
[null,"2019-08-22T20:24:00.900","P002","",1,2,1,1,1,1,2,2,"","","",11]
[null,"2019-08-22T15:51:04.960","P002","サポート",1,2,1,1,1,1,2,2,"","","",11]
[null,"2019-08-22T15:51:02.750","P002","エキスパート",1,2,1,1,1,1,2,2,"","","",11]
[null,"2019-08-22T15:51:01.020","P002","一般職",1,2,1,1,1,1,2,2,"","","",11]
[null,"2019-08-22T15:50:59.100","P002","総合職",1,2,1,1,1,1,2,2,"","","",11]
[null,"2019-08-20T15:06:12.840","B001","エキスパート",1,1,1,1,1,1,1,1,"","","",8]
[null,"2019-08-20T15:06:09.310","B001","エキスパート",1,1,1,1,1,1,1,1,"","","",8]
[null,"2019-08-20T15:06:02.340","B001","",1,1,1,1,1,1,1,1,"","","",8]
[null,"2019-08-20T15:06:00.360","B001","",1,1,1,1,1,1,1,1,"","","",8]
[null,"2019-08-20T15:05:57.500","B001","エキスパート",1,1,1,1,1,1,1,1,"","","",8]
[null,"2019-08-20T15:05:55.380","B001","",1,1,1,1,1,1,1,1,"","","",8]
[null,"2019-08-20T15:05:38.830","B001","総合職",1,1,1,1,1,1,1,1,"","","",8]
[null,"2019-08-20T15:05:33.770","B001",{"$error":"#N/A"},1,1,1,1,1,1,1,1,"","","",8]
[null,"2019-08-20T15:05:30.840","B001","",1,1,1,1,1,1,1,1,"","","",8]
[null,"2019-08-20T15:05:04.170","B001","総合職",1,1,1,1,1,1,1,1,"","","",8]
[null,"2019-08-20T15:04:31.810","B001",{"$error":"#N/A"},1,1,1,1,1,1,1,1,"","","",8]
[null,"2019-08-20T15:04:26.050","B001","総合職",1,1,1,1,1,1,1,1,"","","",8]
[null,"2019-08-20T15:04:19.980","B001",{"$error":"#N/A"},1,1,1,1,1,1,1,1,"","","",8]
[null,"2019-07-24T21:56:28.630","P007","総合職",2,1,1,1,1,1,1,2,1,"","",11]
[null,"2019-07-24T21:56:27.160","P007","総合職",2,1,1,1,1,1,1,2,1,"","",11]
[null,"2019-07-24T21:53:39.200","P007","エキスパート",2,1,1,1,1,1,1,2,1,"","",11]
[null,"2019-07-24T21:53:24.790","P006","エキスパート",1,2,2,2,2,1,1,2,2,"","",15]
[null,"2019-07-24T21:53:14.080","P005","エキスパート",1,1,1,1,1,1,1,1,2,"","",10]
[null,"2019-07-24T21:53:02.420","P004","エキスパート",2,2,1,1,1,2,1,1,1,"","",12]
[null,"2019-07-24T21:52:49.920","P003","エキスパート",1,1,1,2,1,1,2,1,0,"","",10]
[null,"2019-07-24T21:52:44.250","P002","エキスパート",1,2,1,1,1,1,2,2,1,"","",12]
[null,"2019-07-24T21:52:18.530","P001","エキスパート",1,1,1,1,1,1,1,1,1,"","",9]
[null,"2019-07-24T21:51:58.570","B006","エキスパート",2,1,1,2,2,2,3,1,3,"","",17]
[null,"2019-07-24T21:51:56.700","B006","エキスパート",2,1,1,2,2,2,3,1,3,"","",17]
[null,"2019-07-24T21:51:44.430","B005","総合職",2,1,1,2,2,2,2,2,2,"","",16]
[null,"2019-07-24T21:51:43.290","B004","総合職",1,1,2,2,1,2,2,2,2,"","",15]
[null,"2019-07-24T21:51:40.960","B003","総合職",2,2,2,2,1,1,1,1,2,"","",14]
[null,"2019-07-24T21:51:39.420","B002","総合職",1,1,2,1,1,1,1,1,2,"","",11]
[null,"2019-07-24T21:51:35.920","B001","総合職",1,1,1,1,1,1,1,1,1,"","",9]
[null,"2019-07-24T21:51:33.680","B002","総合職",1,1,2,1,1,1,1,1,2,"","",11]
[null,"2019-07-24T21:49:48.620","B001","総合職",1,1,1,1,1,1,1,1,1,"","",9]
[null,"2019-07-24T21:49:41.120","B005","総合職",2,1,1,2,2,2,2,2,2]
[null,"2019-07-24T21:46:28.140","B006","総合職",2,1,1,2,2,2,3,1,3]
[null,"2019-07-24T21:45:14.990","B005","総合職",2,1,1,2,2,2,2,2,2]
[null,"2019-07-24T21:45:12.450","B004","総合職",1,1,2,2,1,2,2,2,2]
[null,"2019-07-24T21:45:09.990","B002","総合職",1,1,2,1,1,1,1,1,2]
[null,"2019-07-24T21:45:08.070","B001","総合職",1,1,1,1,1,1,1,1,1]
[null,"2019-07-24T21:45:05.510","B002","総合職",1,1,2,1,1,1,1,1,2]
[null,"2019-07-24T21:44:59.250","P001","総合職",0,0,0,0,0,0,0,0,0]
[null,"2019-07-24T21:44:54.990","P001","総合職",0,0,0,0,0,0,0,0,0]
[null,"2019-07-24T21:43:58.460","P002","エキスパート",0,0,0,0,0,0,0,0,0]
[null,"2019-07-24T21:43:57.390","B006","エキスパート",2,1,1,2,2,2,3,1,3]
[null,"2019-07-24T21:43:51.970","B006","エキスパート",2,1,1,2,2,2,3,1,3]
[null,"2019-07-24T21:43:30.050","B005","総合職",2,1,1,2,2,2,2,2,2]
[null,"2019-07-24T21:43:14.380","B004","総合職",1,1,2,2,1,2,2,2,2]
[null,"2019-07-24T21:43:01.550","B003","総合職",2,2,2,2,1,1,1,1,2]
[null,"2019-07-24T21:42:35.280","B002","総合職",1,1,2,1,1,1,1,1,2]
[null,"2019-07-24T21:42:09.360","B001","総合職",1,1,1,1,1,1,1,1,1]
[null,"2019-07-24T21:41:50.890","B003","総合職",0,0,0,0,0,0,0,0,0]
[null,"2019-07-24T21:41:12.980","B002","総合職",1,1,2,1,1,1,1,1,""]
[null,"2019-07-24T21:40:56.020","B001","総合職",1,1,1,1,1,1,1,1,""]
[null,"2019-07-24T21:40:40.930","P003","総合職",1,1,1,2,1,1,2,1,""]
[null,"2019-07-24T21:40:39.300","P003","総合職",1,1,1,2,1,1,2,1,""]